BDBM50358264 CHEMBL1922234
SMILES: COc1ccc(cc1)C(=O)Nc1ccc(cc1NC(=O)c1ccc(cc1)N1CCCN(C)CC1)C(O)=O
InChI Key: InChIKey=FLRITYWVZHMTPW-UHFFFAOYSA-N
Data: 1 IC50
Activity Spreadsheet -- Enzyme Inhibition Constant Data from BindingDB
Found 1 hit for monomerid = 50358264
Trg + Lig
Ki
nM
ΔG°
kcal/mole
IC50
nM
Kd
nM
EC50/IC50
nM
koff
s-1
kon
M-1s-1
pHTemp
°C
Coagulation factor X
(Homo sapiens (Human))
BDBM50358264
(CHEMBL1922234)
Show SMILES COc1ccc(cc1)C(=O)Nc1ccc(cc1NC(=O)c1ccc(cc1)N1CCCN(C)CC1)C(O)=O
Show InChI InChI=1S/C28H30N4O5/c1-31-14-3-15-32(17-16-31)22-9-4-19(5-10-22)27(34)30-25-18-21(28(35)36)8-13-24(25)29-26(33)20-6-11-23(37-2)12-7-20/h4-13,18H,3,14-17H2,1-2H3,(H,29,33)(H,30,34)(H,35,36)
Reactome pathway
n/an/a 31.1n/an/an/an/an/an/a
Astellas Pharma Inc
Curated by ChEMBL
Assay Description
Inhibition of human factor 10A using chromogenic substrate S2222 by fluorometric analysis
J Med Chem 54: 8051-65 (2011)
Article DOI: 10.1021/jm200868m
BindingDB Entry DOI: 10.7270/Q2D50ND9