BDBM50358266 CHEMBL1922237
SMILES: COc1ccc(cc1)C(=O)Nc1cc(O)ccc1NC(=O)c1ccc(cc1)N1CCCN(C)CC1
InChI Key: InChIKey=FDJCYWIYECMFRV-UHFFFAOYSA-N
Data: 1 IC50
Activity Spreadsheet -- Enzyme Inhibition Constant Data from BindingDB
Found 1 hit for monomerid = 50358266
Trg + Lig
Ki
nM
ΔG°
kcal/mole
IC50
nM
Kd
nM
EC50/IC50
nM
koff
s-1
kon
M-1s-1
pHTemp
°C
Coagulation factor X
(Homo sapiens (Human))
BDBM50358266
(CHEMBL1922237)
Show SMILES COc1ccc(cc1)C(=O)Nc1cc(O)ccc1NC(=O)c1ccc(cc1)N1CCCN(C)CC1
Show InChI InChI=1S/C27H30N4O4/c1-30-14-3-15-31(17-16-30)21-8-4-19(5-9-21)26(33)28-24-13-10-22(32)18-25(24)29-27(34)20-6-11-23(35-2)12-7-20/h4-13,18,32H,3,14-17H2,1-2H3,(H,28,33)(H,29,34)
Reactome pathway
n/an/a 157n/an/an/an/an/an/a
Astellas Pharma Inc
Curated by ChEMBL
Assay Description
Inhibition of human factor 10A using chromogenic substrate S2222 by fluorometric analysis
J Med Chem 54: 8051-65 (2011)
Article DOI: 10.1021/jm200868m
BindingDB Entry DOI: 10.7270/Q2D50ND9