BDBM50358267 CHEMBL1922238
SMILES: COc1ccc(cc1)C(=O)Nc1cccc(F)c1NC(=O)c1ccc(cc1)N1CCCN(C)CC1
InChI Key: InChIKey=CHRYNXPGERTZAF-UHFFFAOYSA-N
Data: 1 IC50
Activity Spreadsheet -- Enzyme Inhibition Constant Data from BindingDB
Found 1 hit for monomerid = 50358267
Trg + Lig
Ki
nM
ΔG°
kcal/mole
IC50
nM
Kd
nM
EC50/IC50
nM
koff
s-1
kon
M-1s-1
pHTemp
°C
Coagulation factor X
(Homo sapiens (Human))
BDBM50358267
(CHEMBL1922238)
Show SMILES COc1ccc(cc1)C(=O)Nc1cccc(F)c1NC(=O)c1ccc(cc1)N1CCCN(C)CC1
Show InChI InChI=1S/C27H29FN4O3/c1-31-15-4-16-32(18-17-31)21-11-7-19(8-12-21)27(34)30-25-23(28)5-3-6-24(25)29-26(33)20-9-13-22(35-2)14-10-20/h3,5-14H,4,15-18H2,1-2H3,(H,29,33)(H,30,34)
Reactome pathway
n/an/a 155n/an/an/an/an/an/a
Astellas Pharma Inc
Curated by ChEMBL
Assay Description
Inhibition of human factor 10A using chromogenic substrate S2222 by fluorometric analysis
J Med Chem 54: 8051-65 (2011)
Article DOI: 10.1021/jm200868m
BindingDB Entry DOI: 10.7270/Q2D50ND9