BDBM50358269 CHEMBL1922242
SMILES: CN1CCCN(CC1)c1ccc(cc1)C(=O)Nc1c(O)cccc1NC(=O)c1ccc(O)cc1
InChI Key: InChIKey=MVBIRTPZDAZZLQ-UHFFFAOYSA-N
Data: 1 IC50
Activity Spreadsheet -- Enzyme Inhibition Constant Data from BindingDB
Found 1 hit for monomerid = 50358269
Trg + Lig
Ki
nM
ΔG°
kcal/mole
IC50
nM
Kd
nM
EC50/IC50
nM
koff
s-1
kon
M-1s-1
pHTemp
°C
Coagulation factor X
(Homo sapiens (Human))
BDBM50358269
(CHEMBL1922242)
Show SMILES CN1CCCN(CC1)c1ccc(cc1)C(=O)Nc1c(O)cccc1NC(=O)c1ccc(O)cc1
Show InChI InChI=1S/C26H28N4O4/c1-29-14-3-15-30(17-16-29)20-10-6-18(7-11-20)26(34)28-24-22(4-2-5-23(24)32)27-25(33)19-8-12-21(31)13-9-19/h2,4-13,31-32H,3,14-17H2,1H3,(H,27,33)(H,28,34)
Reactome pathway
n/an/a 6.14E+3n/an/an/an/an/an/a
Astellas Pharma Inc
Curated by ChEMBL
Assay Description
Inhibition of human factor 10A using chromogenic substrate S2222 by fluorometric analysis
J Med Chem 54: 8051-65 (2011)
Article DOI: 10.1021/jm200868m
BindingDB Entry DOI: 10.7270/Q2D50ND9