BDBM50358274 CHEMBL1922341
SMILES: COc1ccc(s1)C(=O)Nc1cccc(O)c1NC(=O)c1ccc(cc1)N1CCCN(C)CC1
InChI Key: InChIKey=ROLMZNDAOWOYJK-UHFFFAOYSA-N
Data: 1 IC50
Activity Spreadsheet -- Enzyme Inhibition Constant Data from BindingDB
Found 1 hit for monomerid = 50358274
Trg + Lig
Ki
nM
ΔG°
kcal/mole
IC50
nM
Kd
nM
EC50/IC50
nM
koff
s-1
kon
M-1s-1
pHTemp
°C
Coagulation factor X
(Homo sapiens (Human))
BDBM50358274
(CHEMBL1922341)
Show SMILES COc1ccc(s1)C(=O)Nc1cccc(O)c1NC(=O)c1ccc(cc1)N1CCCN(C)CC1
Show InChI InChI=1S/C25H28N4O4S/c1-28-13-4-14-29(16-15-28)18-9-7-17(8-10-18)24(31)27-23-19(5-3-6-20(23)30)26-25(32)21-11-12-22(33-2)34-21/h3,5-12,30H,4,13-16H2,1-2H3,(H,26,32)(H,27,31)
Reactome pathway
n/an/a 86.1n/an/an/an/an/an/a
Astellas Pharma Inc
Curated by ChEMBL
Assay Description
Inhibition of human factor 10A using chromogenic substrate S2222 by fluorometric analysis
J Med Chem 54: 8051-65 (2011)
Article DOI: 10.1021/jm200868m
BindingDB Entry DOI: 10.7270/Q2D50ND9