BDBM50358402 CHEMBL1922860
SMILES: CCCCCCCCCC(=O)CCC
InChI Key: InChIKey=JWSRUPAFLPWLNO-UHFFFAOYSA-N
Data: 1 EC50
Activity Spreadsheet -- Enzyme Inhibition Constant Data from BindingDB
Found 1 hit for monomerid = 50358402
Trg + Lig
Ki
nM
ΔG°
kcal/mole
IC50
nM
Kd
nM
EC50/IC50
nM
koff
s-1
kon
M-1s-1
pHTemp
°C
CAI-1 autoinducer sensor kinase/phosphatase CqsS
(Vibrio cholerae serotype O1 (strain ATCC 39315 / E...)
BDBM50358402
(CHEMBL1922860)
Show SMILES CCCCCCCCCC(=O)CCC
Show InChI InChI=1S/C13H26O/c1-3-5-6-7-8-9-10-12-13(14)11-4-2/h3-12H2,1-2H3
n/an/an/an/a>5.00E+4n/an/an/an/a
Princeton University
Curated by ChEMBL
Assay Description
Agonist activity at CqsS receptor in cqsA-deficient, luxQ-deficient Vibrio cholerae MM920 harboring cosmid pBB1 carrying Vibrio harveyi luxCDABE gene...
Bioorg Med Chem 19: 6906-18 (2011)
Article DOI: 10.1016/j.bmc.2011.09.021
BindingDB Entry DOI: 10.7270/Q27H1K1T