BDBM50358416 CHEMBL1922846
SMILES: CCCCCC(=O)[C@@H](O)CC
InChI Key: InChIKey=GWTLAJYERXCEGB-QMMMGPOBSA-N
Data: 1 EC50
Activity Spreadsheet -- Enzyme Inhibition Constant Data from BindingDB
Found 1 hit for monomerid = 50358416
Trg + Lig
Ki
nM
ΔG°
kcal/mole
IC50
nM
Kd
nM
EC50/IC50
nM
koff
s-1
kon
M-1s-1
pHTemp
°C
CAI-1 autoinducer sensor kinase/phosphatase CqsS
(Vibrio cholerae serotype O1 (strain ATCC 39315 / E...)
BDBM50358416
(CHEMBL1922846)
Show SMILES CCCCCC(=O)[C@@H](O)CC |r|
Show InChI InChI=1S/C9H18O2/c1-3-5-6-7-9(11)8(10)4-2/h8,10H,3-7H2,1-2H3/t8-/m0/s1
n/an/an/an/a>5.00E+4n/an/an/an/a
Princeton University
Curated by ChEMBL
Assay Description
Agonist activity at CqsS receptor in cqsA-deficient, luxQ-deficient Vibrio cholerae MM920 harboring cosmid pBB1 carrying Vibrio harveyi luxCDABE gene...
Bioorg Med Chem 19: 6906-18 (2011)
Article DOI: 10.1016/j.bmc.2011.09.021
BindingDB Entry DOI: 10.7270/Q27H1K1T