BDBM50358432 CHEMBL1922898
SMILES: Fc1ccccc1Oc1ccc(Nc2ncnc3cc[nH]c23)cc1Cl
InChI Key: InChIKey=XWHJPZMQYNMSOJ-UHFFFAOYSA-N
Data: 1 IC50
Activity Spreadsheet -- Enzyme Inhibition Constant Data from BindingDB
Found 1 hit for monomerid = 50358432
Trg + Lig
Ki
nM
ΔG°
kcal/mole
IC50
nM
Kd
nM
EC50/IC50
nM
koff
s-1
kon
M-1s-1
pHTemp
°C
Receptor tyrosine-protein kinase erbB-2
(Homo sapiens (Human))
BDBM50358432
(CHEMBL1922898)
Show SMILES Fc1ccccc1Oc1ccc(Nc2ncnc3cc[nH]c23)cc1Cl
Show InChI InChI=1S/C18H12ClFN4O/c19-12-9-11(24-18-17-14(7-8-21-17)22-10-23-18)5-6-15(12)25-16-4-2-1-3-13(16)20/h1-10,21H,(H,22,23,24)
n/an/a 9.30n/an/an/an/an/an/a
Takeda Pharmaceutical Company Limited
Curated by ChEMBL
Assay Description
Inhibition of human N-terminus peptide (DYKDDDD)-tagged HER2 expressed in baculovirus infected insect cells using [gamma-32P]ATP as substrate after 6...
J Med Chem 54: 8030-50 (2011)
Article DOI: 10.1021/jm2008634
BindingDB Entry DOI: 10.7270/Q23R0T93