BDBM50358443 CHEMBL1922999
SMILES: Cc1cccc(Oc2ccc(Nc3ncnc4cc[nH]c34)cc2Cl)c1
InChI Key: InChIKey=HHAXMCRVXIYOJR-UHFFFAOYSA-N
Data: 1 IC50
Activity Spreadsheet -- Enzyme Inhibition Constant Data from BindingDB
Found 1 hit for monomerid = 50358443
Trg + Lig
Ki
nM
ΔG°
kcal/mole
IC50
nM
Kd
nM
EC50/IC50
nM
koff
s-1
kon
M-1s-1
pHTemp
°C
Receptor tyrosine-protein kinase erbB-2
(Homo sapiens (Human))
BDBM50358443
(CHEMBL1922999)
Show SMILES Cc1cccc(Oc2ccc(Nc3ncnc4cc[nH]c34)cc2Cl)c1
Show InChI InChI=1S/C19H15ClN4O/c1-12-3-2-4-14(9-12)25-17-6-5-13(10-15(17)20)24-19-18-16(7-8-21-18)22-11-23-19/h2-11,21H,1H3,(H,22,23,24)
n/an/a 4.60n/an/an/an/an/an/a
Takeda Pharmaceutical Company Limited
Curated by ChEMBL
Assay Description
Inhibition of human N-terminus peptide (DYKDDDD)-tagged HER2 expressed in baculovirus infected insect cells using [gamma-32P]ATP as substrate after 6...
J Med Chem 54: 8030-50 (2011)
Article DOI: 10.1021/jm2008634
BindingDB Entry DOI: 10.7270/Q23R0T93