BDBM50358446 CHEMBL1923001
SMILES: Clc1cc(Nc2ncnc3cc[nH]c23)ccc1OCc1ccccn1
InChI Key: InChIKey=SJMHQTPAHZSCGB-UHFFFAOYSA-N
Data: 1 IC50
Activity Spreadsheet -- Enzyme Inhibition Constant Data from BindingDB
Found 1 hit for monomerid = 50358446
Trg + Lig
Ki
nM
ΔG°
kcal/mole
IC50
nM
Kd
nM
EC50/IC50
nM
koff
s-1
kon
M-1s-1
pHTemp
°C
Receptor tyrosine-protein kinase erbB-2
(Homo sapiens (Human))
BDBM50358446
(CHEMBL1923001)
Show SMILES Clc1cc(Nc2ncnc3cc[nH]c23)ccc1OCc1ccccn1
Show InChI InChI=1S/C18H14ClN5O/c19-14-9-12(24-18-17-15(6-8-21-17)22-11-23-18)4-5-16(14)25-10-13-3-1-2-7-20-13/h1-9,11,21H,10H2,(H,22,23,24)
n/an/a 22n/an/an/an/an/an/a
Takeda Pharmaceutical Company Limited
Curated by ChEMBL
Assay Description
Inhibition of human N-terminus peptide (DYKDDDD)-tagged HER2 expressed in baculovirus infected insect cells using [gamma-32P]ATP as substrate after 6...
J Med Chem 54: 8030-50 (2011)
Article DOI: 10.1021/jm2008634
BindingDB Entry DOI: 10.7270/Q23R0T93