BDBM50358450 CHEMBL1923005
SMILES: Cn1ccc2ncnc(Nc3ccc(Oc4cccc(OC(F)(F)F)c4)c(Cl)c3)c12
InChI Key: InChIKey=QFMCOTDYFYKZNH-UHFFFAOYSA-N
Data: 1 IC50
Activity Spreadsheet -- Enzyme Inhibition Constant Data from BindingDB
Found 1 hit for monomerid = 50358450
Trg + Lig
Ki
nM
ΔG°
kcal/mole
IC50
nM
Kd
nM
EC50/IC50
nM
koff
s-1
kon
M-1s-1
pHTemp
°C
Receptor tyrosine-protein kinase erbB-2
(Homo sapiens (Human))
BDBM50358450
(CHEMBL1923005)
Show SMILES Cn1ccc2ncnc(Nc3ccc(Oc4cccc(OC(F)(F)F)c4)c(Cl)c3)c12
Show InChI InChI=1S/C20H14ClF3N4O2/c1-28-8-7-16-18(28)19(26-11-25-16)27-12-5-6-17(15(21)9-12)29-13-3-2-4-14(10-13)30-20(22,23)24/h2-11H,1H3,(H,25,26,27)
n/an/a 17n/an/an/an/an/an/a
Takeda Pharmaceutical Company Limited
Curated by ChEMBL
Assay Description
Inhibition of human N-terminus peptide (DYKDDDD)-tagged HER2 expressed in baculovirus infected insect cells using [gamma-32P]ATP as substrate after 6...
J Med Chem 54: 8030-50 (2011)
Article DOI: 10.1021/jm2008634
BindingDB Entry DOI: 10.7270/Q23R0T93