BDBM50358461 CHEMBL1923016
SMILES: OCCS(=O)(=O)CCn1ccc2ncnc(Nc3ccc(Oc4cccc(c4)C(F)(F)F)c(Cl)c3)c12
InChI Key: InChIKey=YROLHQZDEFQCCR-UHFFFAOYSA-N
Data: 1 IC50
Activity Spreadsheet -- Enzyme Inhibition Constant Data from BindingDB
Found 1 hit for monomerid = 50358461
Trg + Lig
Ki
nM
ΔG°
kcal/mole
IC50
nM
Kd
nM
EC50/IC50
nM
koff
s-1
kon
M-1s-1
pHTemp
°C
Receptor tyrosine-protein kinase erbB-2
(Homo sapiens (Human))
BDBM50358461
(CHEMBL1923016)
Show SMILES OCCS(=O)(=O)CCn1ccc2ncnc(Nc3ccc(Oc4cccc(c4)C(F)(F)F)c(Cl)c3)c12
Show InChI InChI=1S/C23H20ClF3N4O4S/c24-18-13-16(4-5-20(18)35-17-3-1-2-15(12-17)23(25,26)27)30-22-21-19(28-14-29-22)6-7-31(21)8-10-36(33,34)11-9-32/h1-7,12-14,32H,8-11H2,(H,28,29,30)
n/an/a 12n/an/an/an/an/an/a
Takeda Pharmaceutical Company Limited
Curated by ChEMBL
Assay Description
Inhibition of human N-terminus peptide (DYKDDDD)-tagged HER2 expressed in baculovirus infected insect cells using [gamma-32P]ATP as substrate after 6...
J Med Chem 54: 8030-50 (2011)
Article DOI: 10.1021/jm2008634
BindingDB Entry DOI: 10.7270/Q23R0T93