BDBM50358466 CHEMBL1923021
SMILES: CC(C)(O)C(=O)NCCn1ccc2ncnc(Nc3ccc(Oc4cccc(c4)C(F)(F)F)c(Cl)c3)c12
InChI Key: InChIKey=BWWLZGAQCJRAGF-UHFFFAOYSA-N
Data: 1 IC50
Activity Spreadsheet -- Enzyme Inhibition Constant Data from BindingDB
Found 1 hit for monomerid = 50358466
Trg + Lig
Ki
nM
ΔG°
kcal/mole
IC50
nM
Kd
nM
EC50/IC50
nM
koff
s-1
kon
M-1s-1
pHTemp
°C
Receptor tyrosine-protein kinase erbB-2
(Homo sapiens (Human))
BDBM50358466
(CHEMBL1923021)
Show SMILES CC(C)(O)C(=O)NCCn1ccc2ncnc(Nc3ccc(Oc4cccc(c4)C(F)(F)F)c(Cl)c3)c12
Show InChI InChI=1S/C25H23ClF3N5O3/c1-24(2,36)23(35)30-9-11-34-10-8-19-21(34)22(32-14-31-19)33-16-6-7-20(18(26)13-16)37-17-5-3-4-15(12-17)25(27,28)29/h3-8,10,12-14,36H,9,11H2,1-2H3,(H,30,35)(H,31,32,33)
n/an/a 15n/an/an/an/an/an/a
Takeda Pharmaceutical Company Limited
Curated by ChEMBL
Assay Description
Inhibition of human N-terminus peptide (DYKDDDD)-tagged HER2 expressed in baculovirus infected insect cells using [gamma-32P]ATP as substrate after 6...
J Med Chem 54: 8030-50 (2011)
Article DOI: 10.1021/jm2008634
BindingDB Entry DOI: 10.7270/Q23R0T93