null
SMILES: Clc1ccc(cn1)C(=O)COc1ccccc1-c1ccccn1
InChI Key: InChIKey=DXXKBWRRNFQTHZ-UHFFFAOYSA-N
Activity Spreadsheet -- Enzyme Inhibition Constant Data from BindingDB
Found 1 hit for monomerid = 50358780
Trg + Lig
Ki
nM
ΔG°
kcal/mole
IC50
nM
Kd
nM
EC50/IC50
nM
koff
s-1
kon
M-1s-1
pHTemp
°C
Metabotropic glutamate receptor 4
(Homo sapiens (Human))
BDBM50358780
(CHEMBL1922760)
Show SMILES Clc1ccc(cn1)C(=O)COc1ccccc1-c1ccccn1
Show InChI InChI=1S/C18H13ClN2O2/c19-18-9-8-13(11-21-18)16(22)12-23-17-7-2-1-5-14(17)15-6-3-4-10-20-15/h1-11H,12H2
n/an/a 8.00E+3n/an/an/an/an/an/a
Vanderbilt University Medical Center
Curated by ChEMBL
Assay Description
Antagonist activity at human mGlu4 receptor expressed in CHO cells co-expressing Gqi5 assessed as inhibition of EC80 glutamate-induced calcium mobili...
Bioorg Med Chem Lett 21: 6955-9 (2011)
Article DOI: 10.1016/j.bmcl.2011.09.131
BindingDB Entry DOI: 10.7270/Q2S75GRQ