BDBM50358869 CHEMBL1923454
SMILES: Brc1ccc2cc(ccc2c1)S(=O)(=O)N[C@H]1CCCN(CC(=O)N2CCCC2)C1=O
InChI Key: InChIKey=FUENGAMKVWQYQV-IBGZPJMESA-N
Data: 1 IC50
Activity Spreadsheet -- Enzyme Inhibition Constant Data from BindingDB
Found 1 hit for monomerid = 50358869
Trg + Lig
Ki
nM
ΔG°
kcal/mole
IC50
nM
Kd
nM
EC50/IC50
nM
koff
s-1
kon
M-1s-1
pHTemp
°C
Coagulation factor X
(Homo sapiens (Human))
BDBM50358869
(CHEMBL1923454)
Show SMILES Brc1ccc2cc(ccc2c1)S(=O)(=O)N[C@H]1CCCN(CC(=O)N2CCCC2)C1=O |r|
Show InChI InChI=1S/C21H24BrN3O4S/c22-17-7-5-16-13-18(8-6-15(16)12-17)30(28,29)23-19-4-3-11-25(21(19)27)14-20(26)24-9-1-2-10-24/h5-8,12-13,19,23H,1-4,9-11,14H2/t19-/m0/s1
Reactome pathway
n/an/a 19n/an/an/an/an/an/a
Bristol-Myers Squibb Company
Curated by ChEMBL
Assay Description
Inhibition of human factor 10a using phenyl-Ile-Glu-Gly-Arg-pNA as substrate preincubated for 3 mins prior to substrate addition by spectrophotometry
Bioorg Med Chem Lett 21: 7516-21 (2011)
Article DOI: 10.1016/j.bmcl.2011.06.098
BindingDB Entry DOI: 10.7270/Q2MK6DBS