BDBM50358876 CHEMBL1923460
SMILES: Clc1ccc2cc(ccc2c1)S(=O)(=O)N[C@H]1CCCN(CC(=O)N2CCC(C2)c2cccnc2)C1=O
InChI Key: InChIKey=ZDKMPOBKBRWNBR-FHZUCYEKSA-N
Data: 1 IC50
Activity Spreadsheet -- Enzyme Inhibition Constant Data from BindingDB
Found 1 hit for monomerid = 50358876
Trg + Lig
Ki
nM
ΔG°
kcal/mole
IC50
nM
Kd
nM
EC50/IC50
nM
koff
s-1
kon
M-1s-1
pHTemp
°C
Coagulation factor X
(Homo sapiens (Human))
BDBM50358876
(CHEMBL1923460)
Show SMILES Clc1ccc2cc(ccc2c1)S(=O)(=O)N[C@H]1CCCN(CC(=O)N2CCC(C2)c2cccnc2)C1=O |r|
Show InChI InChI=1S/C26H27ClN4O4S/c27-22-7-5-19-14-23(8-6-18(19)13-22)36(34,35)29-24-4-2-11-31(26(24)33)17-25(32)30-12-9-21(16-30)20-3-1-10-28-15-20/h1,3,5-8,10,13-15,21,24,29H,2,4,9,11-12,16-17H2/t21?,24-/m0/s1
Reactome pathway
n/an/a 337n/an/an/an/an/an/a
Bristol-Myers Squibb Company
Curated by ChEMBL
Assay Description
Inhibition of human factor 10a using phenyl-Ile-Glu-Gly-Arg-pNA as substrate preincubated for 3 mins prior to substrate addition by spectrophotometry
Bioorg Med Chem Lett 21: 7516-21 (2011)
Article DOI: 10.1016/j.bmcl.2011.06.098
BindingDB Entry DOI: 10.7270/Q2MK6DBS