BDBM50358887 CHEMBL1923561
SMILES: CS(=O)(=O)N1CC2CC(CN(C2)C(=O)CN2CCC[C@H](NS(=O)(=O)c3ccc4cc(Cl)ccc4c3)C2=O)C1
InChI Key: InChIKey=OVTZCJMBTGSAOF-KXXGJQBSSA-N
Data: 1 IC50
Activity Spreadsheet -- Enzyme Inhibition Constant Data from BindingDB
Found 1 hit for monomerid = 50358887
Trg + Lig
Ki
nM
ΔG°
kcal/mole
IC50
nM
Kd
nM
EC50/IC50
nM
koff
s-1
kon
M-1s-1
pHTemp
°C
Coagulation factor X
(Homo sapiens (Human))
BDBM50358887
(CHEMBL1923561)
Show SMILES CS(=O)(=O)N1CC2CC(CN(C2)C(=O)CN2CCC[C@H](NS(=O)(=O)c3ccc4cc(Cl)ccc4c3)C2=O)C1 |r|
Show InChI InChI=1S/C25H31ClN4O6S2/c1-37(33,34)30-14-17-9-18(15-30)13-29(12-17)24(31)16-28-8-2-3-23(25(28)32)27-38(35,36)22-7-5-19-10-21(26)6-4-20(19)11-22/h4-7,10-11,17-18,23,27H,2-3,8-9,12-16H2,1H3/t17?,18?,23-/m0/s1
Reactome pathway
n/an/a 10n/an/an/an/an/an/a
Bristol-Myers Squibb Company
Curated by ChEMBL
Assay Description
Inhibition of human factor 10a using phenyl-Ile-Glu-Gly-Arg-pNA as substrate preincubated for 3 mins prior to substrate addition by spectrophotometry
Bioorg Med Chem Lett 21: 7516-21 (2011)
Article DOI: 10.1016/j.bmcl.2011.06.098
BindingDB Entry DOI: 10.7270/Q2MK6DBS