BDBM50358935 CHEMBL1923704
SMILES: COc1cccc(c1)-c1c[nH]c(n1)-c1cc(cc(c1)C(=O)N[C@@H](C)c1ccccc1)N(C)S(C)(=O)=O
InChI Key: InChIKey=UCWXKESNYRGXEW-SFHVURJKSA-N
Data: 2 KI  2 IC50  2 EC50
Activity Spreadsheet -- Enzyme Inhibition Constant Data from BindingDB
Found 6 hits for monomerid = 50358935
Trg + Lig
Ki
nM
ΔG°
kcal/mole
IC50
nM
Kd
nM
EC50/IC50
nM
koff
s-1
kon
M-1s-1
pHTemp
°C
Beta-secretase 1
(Homo sapiens (Human))
BDBM50358935
(CHEMBL1923704)
Show SMILES COc1cccc(c1)-c1c[nH]c(n1)-c1cc(cc(c1)C(=O)N[C@@H](C)c1ccccc1)N(C)S(C)(=O)=O |r|
Show InChI InChI=1S/C27H28N4O4S/c1-18(19-9-6-5-7-10-19)29-27(32)22-13-21(14-23(15-22)31(2)36(4,33)34)26-28-17-25(30-26)20-11-8-12-24(16-20)35-3/h5-18H,1-4H3,(H,28,30)(H,29,32)/t18-/m0/s1
62n/an/an/an/an/an/an/an/a
University of Sharjah
Curated by ChEMBL
Assay Description
Inhibition of BACE1 expressing APP Swedish mutant using rhodamine-labeled EVNLDAEFK-quencher as substrate after 60 mins by Michaelis menton equation
J Med Chem 54: 8373-85 (2011)
Checked by Author
Article DOI: 10.1021/jm201181f
BindingDB Entry DOI: 10.7270/Q279453T
Beta-secretase 2
(Homo sapiens (Human))
BDBM50358935
(CHEMBL1923704)
Show SMILES COc1cccc(c1)-c1c[nH]c(n1)-c1cc(cc(c1)C(=O)N[C@@H](C)c1ccccc1)N(C)S(C)(=O)=O |r|
Show InChI InChI=1S/C27H28N4O4S/c1-18(19-9-6-5-7-10-19)29-27(32)22-13-21(14-23(15-22)31(2)36(4,33)34)26-28-17-25(30-26)20-11-8-12-24(16-20)35-3/h5-18H,1-4H3,(H,28,30)(H,29,32)/t18-/m0/s1
2.28E+3n/an/an/an/an/an/an/an/a
University of Sharjah
Curated by ChEMBL
Assay Description
Inhibition of BACE2 expressing APP Swedish mutant using rhodamine-labeled EVNLDAEFK-quencher as substrate after 60 mins by Michaelis menton equation
J Med Chem 54: 8373-85 (2011)
Checked by Author
Article DOI: 10.1021/jm201181f
BindingDB Entry DOI: 10.7270/Q279453T
Beta-secretase 2
(Homo sapiens (Human))
BDBM50358935
(CHEMBL1923704)
Show SMILES COc1cccc(c1)-c1c[nH]c(n1)-c1cc(cc(c1)C(=O)N[C@@H](C)c1ccccc1)N(C)S(C)(=O)=O |r|
Show InChI InChI=1S/C27H28N4O4S/c1-18(19-9-6-5-7-10-19)29-27(32)22-13-21(14-23(15-22)31(2)36(4,33)34)26-28-17-25(30-26)20-11-8-12-24(16-20)35-3/h5-18H,1-4H3,(H,28,30)(H,29,32)/t18-/m0/s1
n/an/a 2.35E+3n/an/an/an/an/an/a
University of Sharjah
Curated by ChEMBL
Assay Description
Inhibition of BACE2 expressing APP Swedish mutant using rhodamine-labeled EVNLDAEFK-quencher as substrate after 60 mins by FRET analysis
J Med Chem 54: 8373-85 (2011)
Checked by Author
Article DOI: 10.1021/jm201181f
BindingDB Entry DOI: 10.7270/Q279453T
Beta-secretase 1
(Homo sapiens (Human))
BDBM50358935
(CHEMBL1923704)
Show SMILES COc1cccc(c1)-c1c[nH]c(n1)-c1cc(cc(c1)C(=O)N[C@@H](C)c1ccccc1)N(C)S(C)(=O)=O |r|
Show InChI InChI=1S/C27H28N4O4S/c1-18(19-9-6-5-7-10-19)29-27(32)22-13-21(14-23(15-22)31(2)36(4,33)34)26-28-17-25(30-26)20-11-8-12-24(16-20)35-3/h5-18H,1-4H3,(H,28,30)(H,29,32)/t18-/m0/s1
n/an/an/an/a 179n/an/an/an/a
University of Sharjah
Curated by ChEMBL
Assay Description
Inhibition of BACE1 in human H4 cells expressing APP Swedish K595N and M596L double mutant assessed as inhibition of amyloid beta (1 to 42) productio...
J Med Chem 54: 8373-85 (2011)
Checked by Author
Article DOI: 10.1021/jm201181f
BindingDB Entry DOI: 10.7270/Q279453T
Beta-secretase 1
(Homo sapiens (Human))
BDBM50358935
(CHEMBL1923704)
Show SMILES COc1cccc(c1)-c1c[nH]c(n1)-c1cc(cc(c1)C(=O)N[C@@H](C)c1ccccc1)N(C)S(C)(=O)=O |r|
Show InChI InChI=1S/C27H28N4O4S/c1-18(19-9-6-5-7-10-19)29-27(32)22-13-21(14-23(15-22)31(2)36(4,33)34)26-28-17-25(30-26)20-11-8-12-24(16-20)35-3/h5-18H,1-4H3,(H,28,30)(H,29,32)/t18-/m0/s1
n/an/an/an/a 179n/an/an/an/a
University of Sharjah
Curated by ChEMBL
Assay Description
Inhibition of BACE1 in human H4 cells expressing APP Swedish K595N and M596L double mutant assessed as inhibition of amyloid beta (1 to 40) productio...
J Med Chem 54: 8373-85 (2011)
Checked by Author
Article DOI: 10.1021/jm201181f
BindingDB Entry DOI: 10.7270/Q279453T
Beta-secretase 1
(Homo sapiens (Human))
BDBM50358935
(CHEMBL1923704)
Show SMILES COc1cccc(c1)-c1c[nH]c(n1)-c1cc(cc(c1)C(=O)N[C@@H](C)c1ccccc1)N(C)S(C)(=O)=O |r|
Show InChI InChI=1S/C27H28N4O4S/c1-18(19-9-6-5-7-10-19)29-27(32)22-13-21(14-23(15-22)31(2)36(4,33)34)26-28-17-25(30-26)20-11-8-12-24(16-20)35-3/h5-18H,1-4H3,(H,28,30)(H,29,32)/t18-/m0/s1
n/an/a 77n/an/an/an/an/an/a
University of Sharjah
Curated by ChEMBL
Assay Description
Inhibition of BACE1 expressing APP Swedish mutant using rhodamine-labeled EVNLDAEFK-quencher as substrate after 60 mins by FRET analysis
J Med Chem 54: 8373-85 (2011)
Checked by Author
Article DOI: 10.1021/jm201181f
BindingDB Entry DOI: 10.7270/Q279453T