null
SMILES: COc1ccc(cn1)-c1ccc(Cn2c(CC(C)(C)C(O)=O)c(SC(C)(C)C)c3cc(OCc4cccc(C)n4)ccc23)cc1
InChI Key: InChIKey=OVQIFNUSFSKOJH-UHFFFAOYSA-N
Activity Spreadsheet -- Enzyme Inhibition Constant Data from BindingDB
Found 4 hits for monomerid = 50359062
Trg + Lig
Ki
nM
ΔG°
kcal/mole
IC50
nM
Kd
nM
EC50/IC50
nM
koff
s-1
kon
M-1s-1
pHTemp
°C
Arachidonate 5-lipoxygenase-activating protein
(Homo sapiens (Human))
BDBM50359062
(CHEMBL1922642)
Show SMILES COc1ccc(cn1)-c1ccc(Cn2c(CC(C)(C)C(O)=O)c(SC(C)(C)C)c3cc(OCc4cccc(C)n4)ccc23)cc1
Show InChI InChI=1S/C37H41N3O4S/c1-24-9-8-10-28(39-24)23-44-29-16-17-31-30(19-29)34(45-36(2,3)4)32(20-37(5,6)35(41)42)40(31)22-25-11-13-26(14-12-25)27-15-18-33(43-7)38-21-27/h8-19,21H,20,22-23H2,1-7H3,(H,41,42)
Reactome pathway
n/an/a 359n/an/an/an/an/an/a
Amira Pharmaceuticals
Curated by ChEMBL
Assay Description
Inhibition of FLAP in human whole blood assessed as inhibition of calcium ionophore A23187-induced LTB4 production preincubated for 5 hrs by ELISA
J Med Chem 54: 8013-29 (2011)
Article DOI: 10.1021/jm2008369
BindingDB Entry DOI: 10.7270/Q269740W
Arachidonate 5-lipoxygenase-activating protein
(Homo sapiens (Human))
BDBM50359062
(CHEMBL1922642)
Show SMILES COc1ccc(cn1)-c1ccc(Cn2c(CC(C)(C)C(O)=O)c(SC(C)(C)C)c3cc(OCc4cccc(C)n4)ccc23)cc1
Show InChI InChI=1S/C37H41N3O4S/c1-24-9-8-10-28(39-24)23-44-29-16-17-31-30(19-29)34(45-36(2,3)4)32(20-37(5,6)35(41)42)40(31)22-25-11-13-26(14-12-25)27-15-18-33(43-7)38-21-27/h8-19,21H,20,22-23H2,1-7H3,(H,41,42)
Reactome pathway
n/an/a 535n/an/an/an/an/an/a
Amira Pharmaceuticals
Curated by ChEMBL
Assay Description
Inhibition of FLAP in human whole blood assessed as inhibition of calcium ionophore A23187-induced LTB4 production preincubated for 15 mins by ELISA
J Med Chem 54: 8013-29 (2011)
Article DOI: 10.1021/jm2008369
BindingDB Entry DOI: 10.7270/Q269740W
Arachidonate 5-lipoxygenase-activating protein
(Homo sapiens (Human))
BDBM50359062
(CHEMBL1922642)
Show SMILES COc1ccc(cn1)-c1ccc(Cn2c(CC(C)(C)C(O)=O)c(SC(C)(C)C)c3cc(OCc4cccc(C)n4)ccc23)cc1
Show InChI InChI=1S/C37H41N3O4S/c1-24-9-8-10-28(39-24)23-44-29-16-17-31-30(19-29)34(45-36(2,3)4)32(20-37(5,6)35(41)42)40(31)22-25-11-13-26(14-12-25)27-15-18-33(43-7)38-21-27/h8-19,21H,20,22-23H2,1-7H3,(H,41,42)
Reactome pathway
n/an/a 0.5n/an/an/an/an/an/a
Amira Pharmaceuticals
Curated by ChEMBL
Assay Description
Inhibition of FLAP in human peripheral leukocytes assessed as inhibition of calcium ionophore A23187-induced LTB4 production after 10 mins by ELISA
J Med Chem 54: 8013-29 (2011)
Article DOI: 10.1021/jm2008369
BindingDB Entry DOI: 10.7270/Q269740W
Arachidonate 5-lipoxygenase-activating protein
(Homo sapiens (Human))
BDBM50359062
(CHEMBL1922642)
Show SMILES COc1ccc(cn1)-c1ccc(Cn2c(CC(C)(C)C(O)=O)c(SC(C)(C)C)c3cc(OCc4cccc(C)n4)ccc23)cc1
Show InChI InChI=1S/C37H41N3O4S/c1-24-9-8-10-28(39-24)23-44-29-16-17-31-30(19-29)34(45-36(2,3)4)32(20-37(5,6)35(41)42)40(31)22-25-11-13-26(14-12-25)27-15-18-33(43-7)38-21-27/h8-19,21H,20,22-23H2,1-7H3,(H,41,42)
Reactome pathway
n/an/a 3.10n/an/an/an/an/an/a
Amira Pharmaceuticals
Curated by ChEMBL
Assay Description
Displacement of [3H]-3-[5-(pyrid-2-ylmethoxy)-3-tert-butylthio-1-benzylindol-2-yl]-2,2-dimethylpropionic acid from FLAP in human polymorphonuclear ce...
J Med Chem 54: 8013-29 (2011)
Article DOI: 10.1021/jm2008369
BindingDB Entry DOI: 10.7270/Q269740W