BDBM50359073 CHEMBL1922653
SMILES: COc1cccc(n1)-c1ccc(Cn2c(CC(C)(C)C(O)=O)c(SC(C)(C)C)c3cc(OCc4ccc(C)cn4)ccc23)cc1
InChI Key: InChIKey=ZMJTXHLYRCCVEO-UHFFFAOYSA-N
Data: 3 IC50
Activity Spreadsheet -- Enzyme Inhibition Constant Data from BindingDB
Found 3 hits for monomerid = 50359073
Trg + Lig
Ki
nM
ΔG°
kcal/mole
IC50
nM
Kd
nM
EC50/IC50
nM
koff
s-1
kon
M-1s-1
pHTemp
°C
Arachidonate 5-lipoxygenase-activating protein
(Homo sapiens (Human))
BDBM50359073
(CHEMBL1922653)
Show SMILES COc1cccc(n1)-c1ccc(Cn2c(CC(C)(C)C(O)=O)c(SC(C)(C)C)c3cc(OCc4ccc(C)cn4)ccc23)cc1
Show InChI InChI=1S/C37H41N3O4S/c1-24-11-16-27(38-21-24)23-44-28-17-18-31-29(19-28)34(45-36(2,3)4)32(20-37(5,6)35(41)42)40(31)22-25-12-14-26(15-13-25)30-9-8-10-33(39-30)43-7/h8-19,21H,20,22-23H2,1-7H3,(H,41,42)
Reactome pathway
n/an/a 233n/an/an/an/an/an/a
Amira Pharmaceuticals
Curated by ChEMBL
Assay Description
Inhibition of FLAP in human whole blood assessed as inhibition of calcium ionophore A23187-induced LTB4 production preincubated for 15 mins by ELISA
J Med Chem 54: 8013-29 (2011)
Article DOI: 10.1021/jm2008369
BindingDB Entry DOI: 10.7270/Q269740W
Arachidonate 5-lipoxygenase-activating protein
(Homo sapiens (Human))
BDBM50359073
(CHEMBL1922653)
Show SMILES COc1cccc(n1)-c1ccc(Cn2c(CC(C)(C)C(O)=O)c(SC(C)(C)C)c3cc(OCc4ccc(C)cn4)ccc23)cc1
Show InChI InChI=1S/C37H41N3O4S/c1-24-11-16-27(38-21-24)23-44-28-17-18-31-29(19-28)34(45-36(2,3)4)32(20-37(5,6)35(41)42)40(31)22-25-12-14-26(15-13-25)30-9-8-10-33(39-30)43-7/h8-19,21H,20,22-23H2,1-7H3,(H,41,42)
Reactome pathway
n/an/a 1.30n/an/an/an/an/an/a
Amira Pharmaceuticals
Curated by ChEMBL
Assay Description
Displacement of [3H]-3-[5-(pyrid-2-ylmethoxy)-3-tert-butylthio-1-benzylindol-2-yl]-2,2-dimethylpropionic acid from FLAP in human polymorphonuclear ce...
J Med Chem 54: 8013-29 (2011)
Article DOI: 10.1021/jm2008369
BindingDB Entry DOI: 10.7270/Q269740W
Arachidonate 5-lipoxygenase-activating protein
(Homo sapiens (Human))
BDBM50359073
(CHEMBL1922653)
Show SMILES COc1cccc(n1)-c1ccc(Cn2c(CC(C)(C)C(O)=O)c(SC(C)(C)C)c3cc(OCc4ccc(C)cn4)ccc23)cc1
Show InChI InChI=1S/C37H41N3O4S/c1-24-11-16-27(38-21-24)23-44-28-17-18-31-29(19-28)34(45-36(2,3)4)32(20-37(5,6)35(41)42)40(31)22-25-12-14-26(15-13-25)30-9-8-10-33(39-30)43-7/h8-19,21H,20,22-23H2,1-7H3,(H,41,42)
Reactome pathway
n/an/a 0.300n/an/an/an/an/an/a
Amira Pharmaceuticals
Curated by ChEMBL
Assay Description
Inhibition of FLAP in human peripheral leukocytes assessed as inhibition of calcium ionophore A23187-induced LTB4 production after 10 mins by ELISA
J Med Chem 54: 8013-29 (2011)
Article DOI: 10.1021/jm2008369
BindingDB Entry DOI: 10.7270/Q269740W