null
SMILES: COc1ccc(cn1)-c1ccc(Cn2c(CC(C)(C)C(O)=O)c(SC(C)(C)C)c3cc(OCc4ccc5cc(F)ccc5n4)ccc23)cc1
InChI Key: InChIKey=ZCLRNMGXXISXBG-UHFFFAOYSA-N
Activity Spreadsheet -- Enzyme Inhibition Constant Data from BindingDB
Found 4 hits for monomerid = 50359096
Trg + Lig
Ki
nM
ΔG°
kcal/mole
IC50
nM
Kd
nM
EC50/IC50
nM
koff
s-1
kon
M-1s-1
pHTemp
°C
Arachidonate 5-lipoxygenase-activating protein
(Homo sapiens (Human))
BDBM50359096
(CHEMBL1922525)
Show SMILES COc1ccc(cn1)-c1ccc(Cn2c(CC(C)(C)C(O)=O)c(SC(C)(C)C)c3cc(OCc4ccc5cc(F)ccc5n4)ccc23)cc1
Show InChI InChI=1S/C40H40FN3O4S/c1-39(2,3)49-37-32-20-31(48-24-30-14-11-27-19-29(41)13-16-33(27)43-30)15-17-34(32)44(35(37)21-40(4,5)38(45)46)23-25-7-9-26(10-8-25)28-12-18-36(47-6)42-22-28/h7-20,22H,21,23-24H2,1-6H3,(H,45,46)
Reactome pathway
n/an/a 289n/an/an/an/an/an/a
Amira Pharmaceuticals
Curated by ChEMBL
Assay Description
Inhibition of FLAP in human whole blood assessed as inhibition of calcium ionophore A23187-induced LTB4 production preincubated for 5 hrs by ELISA
J Med Chem 54: 8013-29 (2011)
Article DOI: 10.1021/jm2008369
BindingDB Entry DOI: 10.7270/Q269740W
Arachidonate 5-lipoxygenase-activating protein
(Homo sapiens (Human))
BDBM50359096
(CHEMBL1922525)
Show SMILES COc1ccc(cn1)-c1ccc(Cn2c(CC(C)(C)C(O)=O)c(SC(C)(C)C)c3cc(OCc4ccc5cc(F)ccc5n4)ccc23)cc1
Show InChI InChI=1S/C40H40FN3O4S/c1-39(2,3)49-37-32-20-31(48-24-30-14-11-27-19-29(41)13-16-33(27)43-30)15-17-34(32)44(35(37)21-40(4,5)38(45)46)23-25-7-9-26(10-8-25)28-12-18-36(47-6)42-22-28/h7-20,22H,21,23-24H2,1-6H3,(H,45,46)
Reactome pathway
n/an/a 7.60n/an/an/an/an/an/a
Amira Pharmaceuticals
Curated by ChEMBL
Assay Description
Displacement of [3H]-3-[5-(pyrid-2-ylmethoxy)-3-tert-butylthio-1-benzylindol-2-yl]-2,2-dimethylpropionic acid from FLAP in human polymorphonuclear ce...
J Med Chem 54: 8013-29 (2011)
Article DOI: 10.1021/jm2008369
BindingDB Entry DOI: 10.7270/Q269740W
Arachidonate 5-lipoxygenase-activating protein
(Homo sapiens (Human))
BDBM50359096
(CHEMBL1922525)
Show SMILES COc1ccc(cn1)-c1ccc(Cn2c(CC(C)(C)C(O)=O)c(SC(C)(C)C)c3cc(OCc4ccc5cc(F)ccc5n4)ccc23)cc1
Show InChI InChI=1S/C40H40FN3O4S/c1-39(2,3)49-37-32-20-31(48-24-30-14-11-27-19-29(41)13-16-33(27)43-30)15-17-34(32)44(35(37)21-40(4,5)38(45)46)23-25-7-9-26(10-8-25)28-12-18-36(47-6)42-22-28/h7-20,22H,21,23-24H2,1-6H3,(H,45,46)
Reactome pathway
n/an/a 0.700n/an/an/an/an/an/a
Amira Pharmaceuticals
Curated by ChEMBL
Assay Description
Inhibition of FLAP in human peripheral leukocytes assessed as inhibition of calcium ionophore A23187-induced LTB4 production after 10 mins by ELISA
J Med Chem 54: 8013-29 (2011)
Article DOI: 10.1021/jm2008369
BindingDB Entry DOI: 10.7270/Q269740W
Arachidonate 5-lipoxygenase-activating protein
(Homo sapiens (Human))
BDBM50359096
(CHEMBL1922525)
Show SMILES COc1ccc(cn1)-c1ccc(Cn2c(CC(C)(C)C(O)=O)c(SC(C)(C)C)c3cc(OCc4ccc5cc(F)ccc5n4)ccc23)cc1
Show InChI InChI=1S/C40H40FN3O4S/c1-39(2,3)49-37-32-20-31(48-24-30-14-11-27-19-29(41)13-16-33(27)43-30)15-17-34(32)44(35(37)21-40(4,5)38(45)46)23-25-7-9-26(10-8-25)28-12-18-36(47-6)42-22-28/h7-20,22H,21,23-24H2,1-6H3,(H,45,46)
Reactome pathway
n/an/a 747n/an/an/an/an/an/a
Amira Pharmaceuticals
Curated by ChEMBL
Assay Description
Inhibition of FLAP in human whole blood assessed as inhibition of calcium ionophore A23187-induced LTB4 production preincubated for 15 mins by ELISA
J Med Chem 54: 8013-29 (2011)
Article DOI: 10.1021/jm2008369
BindingDB Entry DOI: 10.7270/Q269740W