BDBM50359219 CHEMBL1923314
SMILES: CCN1C2=NC(C)(C)CN2c2c(nc(-c3ccc(nc3)-c3ccccc3F)n2Cc2ccc(F)c(F)c2)C1=O
InChI Key: InChIKey=LDNYEXSIGQVIBH-UHFFFAOYSA-N
Data: 1 IC50
Activity Spreadsheet -- Enzyme Inhibition Constant Data from BindingDB
Found 1 hit for monomerid = 50359219
Trg + Lig
Ki
nM
ΔG°
kcal/mole
IC50
nM
Kd
nM
EC50/IC50
nM
koff
s-1
kon
M-1s-1
pHTemp
°C
P2X purinoceptor 7
(Homo sapiens (Human))
BDBM50359219
(CHEMBL1923314)
Show SMILES CCN1C2=NC(C)(C)CN2c2c(nc(-c3ccc(nc3)-c3ccccc3F)n2Cc2ccc(F)c(F)c2)C1=O |t:3|
Show InChI InChI=1S/C29H25F3N6O/c1-4-36-27(39)24-26(38-16-29(2,3)35-28(36)38)37(15-17-9-11-21(31)22(32)13-17)25(34-24)18-10-12-23(33-14-18)19-7-5-6-8-20(19)30/h5-14H,4,15-16H2,1-3H3
n/an/a 52n/an/an/an/an/an/a
Merck Research Laboratories
Curated by ChEMBL
Assay Description
Antagonist activity at P2X7 receptor in LPS-stimulated human whole blood assessed as inhibition of ATP-induced IL1-beta production treated 30 mins be...
Bioorg Med Chem Lett 21: 7287-90 (2011)
Article DOI: 10.1016/j.bmcl.2011.10.037
BindingDB Entry DOI: 10.7270/Q2DV1K8Z