BDBM50359304 CHEMBL1928587
SMILES: CCCCCCCCCCCCCC(=C)CCCC(=O)O\C=C/COC(C)=O
InChI Key: InChIKey=DNMGXMJBUOJKLE-PGMHBOJBSA-N
Data: 2 IC50
Activity Spreadsheet -- Enzyme Inhibition Constant Data from BindingDB
Found 2 hits for monomerid = 50359304
Trg + Lig
Ki
nM
ΔG°
kcal/mole
IC50
nM
Kd
nM
EC50/IC50
nM
koff
s-1
kon
M-1s-1
pHTemp
°C
Cannabinoid receptor 2
(Homo sapiens (Human))
BDBM50359304
(CHEMBL1928587)
Show SMILES CCCCCCCCCCCCCC(=C)CCCC(=O)O\C=C/COC(C)=O
Show InChI InChI=1S/C24H42O4/c1-4-5-6-7-8-9-10-11-12-13-14-17-22(2)18-15-19-24(26)28-21-16-20-27-23(3)25/h16,21H,2,4-15,17-20H2,1,3H3/b21-16-
Reactome pathway
n/an/a>1.00E+4n/an/an/an/an/an/a
University of California
Curated by ChEMBL
Assay Description
Displacement of [3H]CP55940 from human recombinant CB2 receptor expressed in HEK293 cells after 90 mins
J Nat Prod 74: 2313-7 (2011)
Article DOI: 10.1021/np200610t
BindingDB Entry DOI: 10.7270/Q21N81J3
Cannabinoid receptor 1
(Homo sapiens (Human))
BDBM50359304
(CHEMBL1928587)
Show SMILES CCCCCCCCCCCCCC(=C)CCCC(=O)O\C=C/COC(C)=O
Show InChI InChI=1S/C24H42O4/c1-4-5-6-7-8-9-10-11-12-13-14-17-22(2)18-15-19-24(26)28-21-16-20-27-23(3)25/h16,21H,2,4-15,17-20H2,1,3H3/b21-16-
NCI pathway
Reactome pathway
n/an/a>1.00E+4n/an/an/an/an/an/a
University of California
Curated by ChEMBL
Assay Description
Displacement of [3H]CP55940 from human recombinant CB1 receptor expressed in HEK293 cells after 90 mins
J Nat Prod 74: 2313-7 (2011)
Article DOI: 10.1021/np200610t
BindingDB Entry DOI: 10.7270/Q21N81J3