BDBM50359353 CHEMBL1929232
SMILES: COCCN1CCN(CCC1=O)C(=O)c1cc(sc1NC(=O)Nc1cccc(Cl)c1Cl)C(C)(C)C
InChI Key: InChIKey=QUGXAVNFYMLVLL-UHFFFAOYSA-N
Data: 1 IC50
Activity Spreadsheet -- Enzyme Inhibition Constant Data from BindingDB
Found 1 hit for monomerid = 50359353
Trg + Lig
Ki
nM
ΔG°
kcal/mole
IC50
nM
Kd
nM
EC50/IC50
nM
koff
s-1
kon
M-1s-1
pHTemp
°C
Mitogen-activated protein kinase 14
(Homo sapiens (Human))
BDBM50359353
(CHEMBL1929232)
Show SMILES COCCN1CCN(CCC1=O)C(=O)c1cc(sc1NC(=O)Nc1cccc(Cl)c1Cl)C(C)(C)C
Show InChI InChI=1S/C24H30Cl2N4O4S/c1-24(2,3)18-14-15(22(32)30-9-8-19(31)29(10-11-30)12-13-34-4)21(35-18)28-23(33)27-17-7-5-6-16(25)20(17)26/h5-7,14H,8-13H2,1-4H3,(H2,27,28,33)
NCI pathway
Reactome pathway
n/an/a 140n/an/an/an/an/an/a
Ansaris
Curated by ChEMBL
Assay Description
Inhibition of p38alpha assessed as [33P]gamma-ATP incorporation into GST-ATF2 substrate preincubated for 20 mins before substrate addition measured a...
Bioorg Med Chem Lett 21: 7155-65 (2011)
Article DOI: 10.1016/j.bmcl.2011.09.078
BindingDB Entry DOI: 10.7270/Q2NC61NH