BDBM50359355 CHEMBL1929234
SMILES: CC(C)(C)c1cc(C(=O)N2CCN(CC3COC(C)(C)O3)C(=O)CC2)c(NC(=O)Nc2cccc(Cl)c2Cl)s1
InChI Key: InChIKey=SZUALHHRXIZANV-UHFFFAOYSA-N
Data: 1 IC50
Activity Spreadsheet -- Enzyme Inhibition Constant Data from BindingDB
Found 1 hit for monomerid = 50359355
Trg + Lig
Ki
nM
ΔG°
kcal/mole
IC50
nM
Kd
nM
EC50/IC50
nM
koff
s-1
kon
M-1s-1
pHTemp
°C
Mitogen-activated protein kinase 14
(Homo sapiens (Human))
BDBM50359355
(CHEMBL1929234)
Show SMILES CC(C)(C)c1cc(C(=O)N2CCN(CC3COC(C)(C)O3)C(=O)CC2)c(NC(=O)Nc2cccc(Cl)c2Cl)s1
Show InChI InChI=1S/C27H34Cl2N4O5S/c1-26(2,3)20-13-17(23(39-20)31-25(36)30-19-8-6-7-18(28)22(19)29)24(35)32-10-9-21(34)33(12-11-32)14-16-15-37-27(4,5)38-16/h6-8,13,16H,9-12,14-15H2,1-5H3,(H2,30,31,36)
NCI pathway
Reactome pathway
n/an/a 31n/an/an/an/an/an/a
Ansaris
Curated by ChEMBL
Assay Description
Inhibition of p38alpha assessed as [33P]gamma-ATP incorporation into GST-ATF2 substrate preincubated for 20 mins before substrate addition measured a...
Bioorg Med Chem Lett 21: 7155-65 (2011)
Article DOI: 10.1016/j.bmcl.2011.09.078
BindingDB Entry DOI: 10.7270/Q2NC61NH