BDBM50359409 CHEMBL1926721
SMILES: CCOC(=O)Nc1cc(NCCN(C)C)c2nc(-c3ccccc3)c(nc2n1)-c1ccccc1
InChI Key: InChIKey=HHICWLZMNOCMIQ-UHFFFAOYSA-N
Data: 1 IC50
Activity Spreadsheet -- Enzyme Inhibition Constant Data from BindingDB
Found 1 hit for monomerid = 50359409
Trg + Lig
Ki
nM
ΔG°
kcal/mole
IC50
nM
Kd
nM
EC50/IC50
nM
koff
s-1
kon
M-1s-1
pHTemp
°C
Cell division protein FtsZ
(Mycobacterium tuberculosis)
BDBM50359409
(CHEMBL1926721)
Show SMILES CCOC(=O)Nc1cc(NCCN(C)C)c2nc(-c3ccccc3)c(nc2n1)-c1ccccc1
Show InChI InChI=1S/C26H28N6O2/c1-4-34-26(33)29-21-17-20(27-15-16-32(2)3)24-25(28-21)31-23(19-13-9-6-10-14-19)22(30-24)18-11-7-5-8-12-18/h5-14,17H,4,15-16H2,1-3H3,(H2,27,28,29,31,33)
n/an/a 5.46E+4n/an/an/an/an/an/a
Southern Research Institute
Curated by ChEMBL
Assay Description
Inhibition of Mycobacterium tuberculosis FtsZ polymerization expressed in Escherichia coli by light scattering assay
Bioorg Med Chem 19: 7120-8 (2011)
Article DOI: 10.1016/j.bmc.2011.09.062
BindingDB Entry DOI: 10.7270/Q2VX0GZ1