BDBM50359478 CHEMBL1927009
SMILES: COc1ccc(cc1)N(Cc1cccc(n1)C#N)C1CCN(CC1)[C@H](C)CCNC(=O)c1c(C)cc(Cl)nc1C
InChI Key: InChIKey=SUARYOFQUGTMDI-JOCHJYFZSA-N
Data: 1 IC50
Activity Spreadsheet -- Enzyme Inhibition Constant Data from BindingDB
Found 1 hit for monomerid = 50359478
Trg + Lig
Ki
nM
ΔG°
kcal/mole
IC50
nM
Kd
nM
EC50/IC50
nM
koff
s-1
kon
M-1s-1
pHTemp
°C
C-C chemokine receptor type 5
(Homo sapiens (Human))
BDBM50359478
(CHEMBL1927009)
Show SMILES COc1ccc(cc1)N(Cc1cccc(n1)C#N)C1CCN(CC1)[C@H](C)CCNC(=O)c1c(C)cc(Cl)nc1C |r|
Show InChI InChI=1S/C31H37ClN6O2/c1-21-18-29(32)35-23(3)30(21)31(39)34-15-12-22(2)37-16-13-27(14-17-37)38(26-8-10-28(40-4)11-9-26)20-25-7-5-6-24(19-33)36-25/h5-11,18,22,27H,12-17,20H2,1-4H3,(H,34,39)/t22-/m1/s1
n/an/a 0.300n/an/an/an/an/an/a
Genzyme Corp.
Curated by ChEMBL
Assay Description
Antagonist activity against human CCR5 assessed as inhibition of HIV1 gp120-induced cell-cell fusion between human HeLa P4/R5 cells and CHO-tat10 cel...
Bioorg Med Chem Lett 21: 6950-4 (2011)
Article DOI: 10.1016/j.bmcl.2011.09.133
BindingDB Entry DOI: 10.7270/Q2GM87RZ