BDBM50359737 CHEMBL1927722
SMILES: S=c1[nH]c2ccccc2c(=S)n1-c1ccccc1
InChI Key: InChIKey=DJJOAJCVIYRELX-UHFFFAOYSA-N
Data: 2 IC50
Activity Spreadsheet -- Enzyme Inhibition Constant Data from BindingDB
Found 2 hits for monomerid = 50359737
Trg + Lig
Ki
nM
ΔG°
kcal/mole
IC50
nM
Kd
nM
EC50/IC50
nM
koff
s-1
kon
M-1s-1
pHTemp
°C
Phosphodiesterase 7
(Homo sapiens (Human))
BDBM50359737
(CHEMBL1927722)
Show SMILES S=c1[nH]c2ccccc2c(=S)n1-c1ccccc1
Show InChI InChI=1S/C14H10N2S2/c17-13-11-8-4-5-9-12(11)15-14(18)16(13)10-6-2-1-3-7-10/h1-9H,(H,15,18)
Reactome pathway
n/an/a 1.04E+3n/an/an/an/an/an/a
Instituto de Qu£mica M£dica (CSIC)
Curated by ChEMBL
Assay Description
Inhibition of PDE7A assessed as hydrolysis of [3H]cAMP after 20 mins by scintillation proximity assay
Eur J Med Chem 47: 175-85 (2012)
Article DOI: 10.1016/j.ejmech.2011.10.040
BindingDB Entry DOI: 10.7270/Q20G3KJS
Phosphodiesterase 7
(Homo sapiens (Human))
BDBM50359737
(CHEMBL1927722)
Show SMILES S=c1[nH]c2ccccc2c(=S)n1-c1ccccc1
Show InChI InChI=1S/C14H10N2S2/c17-13-11-8-4-5-9-12(11)15-14(18)16(13)10-6-2-1-3-7-10/h1-9H,(H,15,18)
n/an/a 1.04E+3n/an/an/an/an/an/a
Centro de Investigaciones Biol�gicas (CSIC)
Curated by ChEMBL
Assay Description
Inhibition of PDE7 (unknown origin)
J Med Chem 57: 8590-607 (2014)
Article DOI: 10.1021/jm501090m
BindingDB Entry DOI: 10.7270/Q2S75HXC