BDBM50359887 CHEMBL259902
SMILES: Clc1ccc(\C=C2/S\C(NC2=O)=N\c2nc3ccccc3s2)cc1
InChI Key: InChIKey=CPSYCWALYFIJTB-ZROIWOOFSA-N
Data: 2 IC50
Activity Spreadsheet -- Enzyme Inhibition Constant Data from BindingDB
Found 2 hits for monomerid = 50359887
Trg + Lig
Ki
nM
ΔG°
kcal/mole
IC50
nM
Kd
nM
EC50/IC50
nM
koff
s-1
kon
M-1s-1
pHTemp
°C
Lipoxygenase-1
(Glycine max (soybean))
BDBM50359887
(CHEMBL259902)
Show SMILES Clc1ccc(\C=C2/S\C(NC2=O)=N\c2nc3ccccc3s2)cc1
Show InChI InChI=1S/C17H10ClN3OS2/c18-11-7-5-10(6-8-11)9-14-15(22)20-17(24-14)21-16-19-12-3-1-2-4-13(12)23-16/h1-9H,(H,19,20,21,22)/b14-9-
n/an/a 5.00E+4n/an/an/an/an/an/a
Alexander Technological Education Institute of Thessaloniki
Curated by ChEMBL
Assay Description
Inhibition of soybean LOX type 1 pre-incubated for 4 mins at 7x10'-7 w/v concentration assessed as inhibition of sodium linoleate to 13-hydroperoxyli...
Eur J Med Chem 47: 111-24 (2012)
Article DOI: 10.1016/j.ejmech.2011.10.029
BindingDB Entry DOI: 10.7270/Q2K937ZK
Prostaglandin G/H synthase (cyclooxygenase)
(Ovis aries (Sheep))
BDBM50359887
(CHEMBL259902)
Show SMILES Clc1ccc(\C=C2/S\C(NC2=O)=N\c2nc3ccccc3s2)cc1
Show InChI InChI=1S/C17H10ClN3OS2/c18-11-7-5-10(6-8-11)9-14-15(22)20-17(24-14)21-16-19-12-3-1-2-4-13(12)23-16/h1-9H,(H,19,20,21,22)/b14-9-
n/an/a 310n/an/an/an/an/an/a
Alexander Technological Education Institute of Thessaloniki
Curated by ChEMBL
Assay Description
Inhibition of ovine COX1 assessed as PGF2alpha production by enzyme immunoassay
Eur J Med Chem 47: 111-24 (2012)
Article DOI: 10.1016/j.ejmech.2011.10.029
BindingDB Entry DOI: 10.7270/Q2K937ZK