BDBM50360028 CHEMBL1928525
SMILES: CN(\N=C\c1cnn2ccc(Br)cc12)S(=O)(=O)c1cc(ccc1C)[N+]([O-])=O
InChI Key: InChIKey=DENMXNSYDWJPQR-GIJQJNRQSA-N
Data: 3 IC50
Activity Spreadsheet -- Enzyme Inhibition Constant Data from BindingDB
Found 3 hits for monomerid = 50360028
Trg + Lig
Ki
nM
ΔG°
kcal/mole
IC50
nM
Kd
nM
EC50/IC50
nM
koff
s-1
kon
M-1s-1
pHTemp
°C
Phosphatidylinositol 4,5-bisphosphate 3-kinase catalytic subunit alpha isoform
(Homo sapiens (Human))
BDBM50360028
(CHEMBL1928525)
Show SMILES CN(\N=C\c1cnn2ccc(Br)cc12)S(=O)(=O)c1cc(ccc1C)[N+]([O-])=O
Show InChI InChI=1S/C16H14BrN5O4S/c1-11-3-4-14(22(23)24)8-16(11)27(25,26)20(2)18-9-12-10-19-21-6-5-13(17)7-15(12)21/h3-10H,1-2H3/b18-9+
NCI pathway
Reactome pathway
n/an/a 3.80n/an/an/an/an/an/a
University of Auckland
Curated by ChEMBL
Assay Description
Inhibition of recombinant PI3K p110alpha using L-alpha-phosphotidylinositol as substrate and [gamma33P]ATP after 60 mins by thin layer chromatographi...
Bioorg Med Chem 20: 69-85 (2011)
Article DOI: 10.1016/j.bmc.2011.11.029
BindingDB Entry DOI: 10.7270/Q2513ZNR
Phosphatidylinositol 4,5-bisphosphate 3-kinase catalytic subunit delta isoform
(Homo sapiens (Human))
BDBM50360028
(CHEMBL1928525)
Show SMILES CN(\N=C\c1cnn2ccc(Br)cc12)S(=O)(=O)c1cc(ccc1C)[N+]([O-])=O
Show InChI InChI=1S/C16H14BrN5O4S/c1-11-3-4-14(22(23)24)8-16(11)27(25,26)20(2)18-9-12-10-19-21-6-5-13(17)7-15(12)21/h3-10H,1-2H3/b18-9+
NCI pathway
Reactome pathway
n/an/a 150n/an/an/an/an/an/a
University of Auckland
Curated by ChEMBL
Assay Description
Inhibition of recombinant PI3K p110delta using L-alpha-phosphotidylinositol as substrate and [gamma33P]ATP after 60 mins by thin layer chromatographi...
Bioorg Med Chem 20: 69-85 (2011)
Article DOI: 10.1016/j.bmc.2011.11.029
BindingDB Entry DOI: 10.7270/Q2513ZNR
Phosphatidylinositol 4,5-bisphosphate 3-kinase catalytic subunit beta isoform
(Homo sapiens (Human))
BDBM50360028
(CHEMBL1928525)
Show SMILES CN(\N=C\c1cnn2ccc(Br)cc12)S(=O)(=O)c1cc(ccc1C)[N+]([O-])=O
Show InChI InChI=1S/C16H14BrN5O4S/c1-11-3-4-14(22(23)24)8-16(11)27(25,26)20(2)18-9-12-10-19-21-6-5-13(17)7-15(12)21/h3-10H,1-2H3/b18-9+
NCI pathway
Reactome pathway
n/an/a 230n/an/an/an/an/an/a
University of Auckland
Curated by ChEMBL
Assay Description
Inhibition of recombinant PI3K p110beta using L-alpha-phosphotidylinositol as substrate and [gamma33P]ATP after 60 mins by thin layer chromatographic...
Bioorg Med Chem 20: 69-85 (2011)
Article DOI: 10.1016/j.bmc.2011.11.029
BindingDB Entry DOI: 10.7270/Q2513ZNR