null
SMILES: Cc1ncnc(Nc2ccc(OCc3cccc(F)c3)c(Cl)c2)c1\C=C\c1ccc(CNCCS(C)(=O)=O)cc1
InChI Key: InChIKey=BLLJPLGCOYWICB-ZRDIBKRKSA-N
Activity Spreadsheet -- Enzyme Inhibition Constant Data from BindingDB
Found 2 hits for monomerid = 50360465
Trg + Lig
Ki
nM
ΔG°
kcal/mole
IC50
nM
Kd
nM
EC50/IC50
nM
koff
s-1
kon
M-1s-1
pHTemp
°C
Receptor tyrosine-protein kinase erbB-2
(Homo sapiens (Human))
BDBM50360465
(CHEMBL1934631)
Show SMILES Cc1ncnc(Nc2ccc(OCc3cccc(F)c3)c(Cl)c2)c1\C=C\c1ccc(CNCCS(C)(=O)=O)cc1
Show InChI InChI=1S/C30H30ClFN4O3S/c1-21-27(12-10-22-6-8-23(9-7-22)18-33-14-15-40(2,37)38)30(35-20-34-21)36-26-11-13-29(28(31)17-26)39-19-24-4-3-5-25(32)16-24/h3-13,16-17,20,33H,14-15,18-19H2,1-2H3,(H,34,35,36)/b12-10+
n/an/a 120n/an/an/an/an/an/a
Shionogi& Co., Ltd
Curated by ChEMBL
Assay Description
Inhibition of Her-2 by time-resolved fluorescence assay
Bioorg Med Chem Lett 22: 456-60 (2011)
Article DOI: 10.1016/j.bmcl.2011.10.103
BindingDB Entry DOI: 10.7270/Q2NV9JP4
Epidermal growth factor receptor
(Homo sapiens (Human))
BDBM50360465
(CHEMBL1934631)
Show SMILES Cc1ncnc(Nc2ccc(OCc3cccc(F)c3)c(Cl)c2)c1\C=C\c1ccc(CNCCS(C)(=O)=O)cc1
Show InChI InChI=1S/C30H30ClFN4O3S/c1-21-27(12-10-22-6-8-23(9-7-22)18-33-14-15-40(2,37)38)30(35-20-34-21)36-26-11-13-29(28(31)17-26)39-19-24-4-3-5-25(32)16-24/h3-13,16-17,20,33H,14-15,18-19H2,1-2H3,(H,34,35,36)/b12-10+
n/an/a 94n/an/an/an/an/an/a
Shionogi& Co., Ltd
Curated by ChEMBL
Assay Description
Inhibition of EGFR phosphorylation in EGF-stimulated human A431 after 2 hrs by Western blot analysis
Bioorg Med Chem Lett 22: 456-60 (2011)
Article DOI: 10.1016/j.bmcl.2011.10.103
BindingDB Entry DOI: 10.7270/Q2NV9JP4