BDBM50360671 CHEMBL1933766
SMILES: CCCCNC(=O)c1ccc(Oc2ccc(CC(O)=O)cc2OC)c(NS(=O)(=O)c2ccc(Cl)cc2)c1
InChI Key: InChIKey=TXUOHRIWXDQNGI-UHFFFAOYSA-N
Data: 5 IC50
Activity Spreadsheet -- Enzyme Inhibition Constant Data from BindingDB
Found 5 hits for monomerid = 50360671
Trg + Lig
Ki
nM
ΔG°
kcal/mole
IC50
nM
Kd
nM
EC50/IC50
nM
koff
s-1
kon
M-1s-1
pHTemp
°C
G protein-coupled receptor 44
(Homo sapiens (Human))
BDBM50360671
(CHEMBL1933766)
Show SMILES CCCCNC(=O)c1ccc(Oc2ccc(CC(O)=O)cc2OC)c(NS(=O)(=O)c2ccc(Cl)cc2)c1
Show InChI InChI=1S/C26H27ClN2O7S/c1-3-4-13-28-26(32)18-6-12-22(36-23-11-5-17(15-25(30)31)14-24(23)35-2)21(16-18)29-37(33,34)20-9-7-19(27)8-10-20/h5-12,14,16,29H,3-4,13,15H2,1-2H3,(H,28,32)(H,30,31)
Reactome pathway
n/an/a 100n/an/an/an/an/an/a
TBA
Curated by ChEMBL
Assay Description
Displacement of [3H]-PGD2 from human CRTH2 receptor expressed in human HEK293 cells by scintillation counter in presence of 50% human plasma
ACS Med Chem Lett 2: 326-330 (2011)
Article DOI: 10.1021/ml1002234
BindingDB Entry DOI: 10.7270/Q28K79JH
G protein-coupled receptor 44
(Homo sapiens (Human))
BDBM50360671
(CHEMBL1933766)
Show SMILES CCCCNC(=O)c1ccc(Oc2ccc(CC(O)=O)cc2OC)c(NS(=O)(=O)c2ccc(Cl)cc2)c1
Show InChI InChI=1S/C26H27ClN2O7S/c1-3-4-13-28-26(32)18-6-12-22(36-23-11-5-17(15-25(30)31)14-24(23)35-2)21(16-18)29-37(33,34)20-9-7-19(27)8-10-20/h5-12,14,16,29H,3-4,13,15H2,1-2H3,(H,28,32)(H,30,31)
Reactome pathway
n/an/a 4n/an/an/an/an/an/a
TBA
Curated by ChEMBL
Assay Description
Displacement of [3H]-PGD2 from human CRTH2 receptor expressed in human HEK293 cells by scintillation counter in presence of 0.5% bovine serum albumin
ACS Med Chem Lett 2: 326-330 (2011)
Article DOI: 10.1021/ml1002234
BindingDB Entry DOI: 10.7270/Q28K79JH
Prostanoid DP receptor
(Homo sapiens (Human))
BDBM50360671
(CHEMBL1933766)
Show SMILES CCCCNC(=O)c1ccc(Oc2ccc(CC(O)=O)cc2OC)c(NS(=O)(=O)c2ccc(Cl)cc2)c1
Show InChI InChI=1S/C26H27ClN2O7S/c1-3-4-13-28-26(32)18-6-12-22(36-23-11-5-17(15-25(30)31)14-24(23)35-2)21(16-18)29-37(33,34)20-9-7-19(27)8-10-20/h5-12,14,16,29H,3-4,13,15H2,1-2H3,(H,28,32)(H,30,31)
n/an/a 13n/an/an/an/an/an/a
TBA
Curated by ChEMBL
Assay Description
Displacement of [3H]-PGD2 from human Prostanoid DP receptor expressed in human HEK293 cells by scintillation counter in presence of 0.5% bovine serum...
ACS Med Chem Lett 2: 326-330 (2011)
Article DOI: 10.1021/ml1002234
BindingDB Entry DOI: 10.7270/Q28K79JH
Prostanoid DP receptor
(Homo sapiens (Human))
BDBM50360671
(CHEMBL1933766)
Show SMILES CCCCNC(=O)c1ccc(Oc2ccc(CC(O)=O)cc2OC)c(NS(=O)(=O)c2ccc(Cl)cc2)c1
Show InChI InChI=1S/C26H27ClN2O7S/c1-3-4-13-28-26(32)18-6-12-22(36-23-11-5-17(15-25(30)31)14-24(23)35-2)21(16-18)29-37(33,34)20-9-7-19(27)8-10-20/h5-12,14,16,29H,3-4,13,15H2,1-2H3,(H,28,32)(H,30,31)
n/an/a 13n/an/an/an/an/an/a
Amgen Inc.
Curated by ChEMBL
Assay Description
Displacement of [3H]PGD2 from human DP receptor expressed in 293 cells by scintillation counting in presence of 0.5 % BSA
Bioorg Med Chem Lett 22: 367-70 (2011)
Article DOI: 10.1016/j.bmcl.2011.10.123
BindingDB Entry DOI: 10.7270/Q2057GB8
G protein-coupled receptor 44
(Homo sapiens (Human))
BDBM50360671
(CHEMBL1933766)
Show SMILES CCCCNC(=O)c1ccc(Oc2ccc(CC(O)=O)cc2OC)c(NS(=O)(=O)c2ccc(Cl)cc2)c1
Show InChI InChI=1S/C26H27ClN2O7S/c1-3-4-13-28-26(32)18-6-12-22(36-23-11-5-17(15-25(30)31)14-24(23)35-2)21(16-18)29-37(33,34)20-9-7-19(27)8-10-20/h5-12,14,16,29H,3-4,13,15H2,1-2H3,(H,28,32)(H,30,31)
Reactome pathway
n/an/a 4n/an/an/an/an/an/a
Amgen Inc.
Curated by ChEMBL
Assay Description
Displacement of [3H]PGD2 from human CRTH2 receptor expressed in 293 cells by scintillation counting in presence of 0.5 % BSA
Bioorg Med Chem Lett 22: 367-70 (2011)
Article DOI: 10.1016/j.bmcl.2011.10.123
BindingDB Entry DOI: 10.7270/Q2057GB8