null
SMILES: NC(=O)n1c2ccccc2c2cc(CN3CCC4(CC3)C=Cc3ccccc43)ccc12
InChI Key: InChIKey=ZCEIJEMGJDGCGW-UHFFFAOYSA-N
Activity Spreadsheet -- Enzyme Inhibition Constant Data from BindingDB
Found 1 hit for monomerid = 50360694
Trg + Lig
Ki
nM
ΔG°
kcal/mole
IC50
nM
Kd
nM
EC50/IC50
nM
koff
s-1
kon
M-1s-1
pHTemp
°C
Melanin-concentrating hormone receptor 2
(Homo sapiens (Human))
BDBM50360694
(CHEMBL1934112)
Show SMILES NC(=O)n1c2ccccc2c2cc(CN3CCC4(CC3)C=Cc3ccccc43)ccc12 |c:22|
Show InChI InChI=1S/C27H25N3O/c28-26(31)30-24-8-4-2-6-21(24)22-17-19(9-10-25(22)30)18-29-15-13-27(14-16-29)12-11-20-5-1-3-7-23(20)27/h1-12,17H,13-16,18H2,(H2,28,31)
Reactome pathway
n/an/a 4n/an/an/an/an/an/a
Amgen Inc.
Curated by ChEMBL
Assay Description
Antagonist activity at human MCHR2 receptor expressed in CHO cells assessed as inhibition of MCH-stimulated Ca2+ flux preincubated for 10 mins prior ...
Bioorg Med Chem Lett 22: 363-6 (2011)
Article DOI: 10.1016/j.bmcl.2011.10.125
BindingDB Entry DOI: 10.7270/Q2VD6ZW1