BDBM50360815 CHEMBL1934793
SMILES: Clc1ccc(cc1)-c1nc2c(cnc3cc(Br)ccc23)[nH]1
InChI Key: InChIKey=LQZLGYSSMDMQJY-UHFFFAOYSA-N
Data: 1 IC50
Activity Spreadsheet -- Enzyme Inhibition Constant Data from BindingDB
Found 1 hit for monomerid = 50360815
Trg + Lig
Ki
nM
ΔG°
kcal/mole
IC50
nM
Kd
nM
EC50/IC50
nM
koff
s-1
kon
M-1s-1
pHTemp
°C
Prostaglandin E synthase
(Homo sapiens (Human))
BDBM50360815
(CHEMBL1934793)
Show SMILES Clc1ccc(cc1)-c1nc2c(cnc3cc(Br)ccc23)[nH]1
Show InChI InChI=1S/C16H9BrClN3/c17-10-3-6-12-13(7-10)19-8-14-15(12)21-16(20-14)9-1-4-11(18)5-2-9/h1-8H,(H,20,21)
Reactome pathway
n/an/a>1.00E+4n/an/an/an/an/an/a
Dainippon Sumitomo Pharma. Co. Ltd
Curated by ChEMBL
Assay Description
Inhibition of microsomal PGES1 transfected in human HEK293 cells assessed as PGE2 production after 60 mins by HTRF assay
Bioorg Med Chem Lett 22: 285-8 (2011)
Article DOI: 10.1016/j.bmcl.2011.11.015
BindingDB Entry DOI: 10.7270/Q2PR7WFN