BDBM50360817 CHEMBL1934795
SMILES: Cc1cccc(c1)-c1nc2c(cnc3cc(Br)ccc23)[nH]1
InChI Key: InChIKey=VBSLUTVCFSHBPF-UHFFFAOYSA-N
Data: 2 IC50
Activity Spreadsheet -- Enzyme Inhibition Constant Data from BindingDB
Found 2 hits for monomerid = 50360817
Trg + Lig
Ki
nM
ΔG°
kcal/mole
IC50
nM
Kd
nM
EC50/IC50
nM
koff
s-1
kon
M-1s-1
pHTemp
°C
Prostaglandin E synthase
(Homo sapiens (Human))
BDBM50360817
(CHEMBL1934795)
Show SMILES Cc1cccc(c1)-c1nc2c(cnc3cc(Br)ccc23)[nH]1
Show InChI InChI=1S/C17H12BrN3/c1-10-3-2-4-11(7-10)17-20-15-9-19-14-8-12(18)5-6-13(14)16(15)21-17/h2-9H,1H3,(H,20,21)
Reactome pathway
n/an/a 1.49E+3n/an/an/an/an/an/a
Dainippon Sumitomo Pharma. Co. Ltd
Curated by ChEMBL
Assay Description
Inhibition of microsomal PGES1 transfected in human HEK293 cells assessed as PGE2 production after 60 mins by HTRF assay
Bioorg Med Chem Lett 22: 285-8 (2011)
Article DOI: 10.1016/j.bmcl.2011.11.015
BindingDB Entry DOI: 10.7270/Q2PR7WFN
Prostaglandin E synthase
(Homo sapiens (Human))
BDBM50360817
(CHEMBL1934795)
Show SMILES Cc1cccc(c1)-c1nc2c(cnc3cc(Br)ccc23)[nH]1
Show InChI InChI=1S/C17H12BrN3/c1-10-3-2-4-11(7-10)17-20-15-9-19-14-8-12(18)5-6-13(14)16(15)21-17/h2-9H,1H3,(H,20,21)
Reactome pathway
n/an/a 1.50E+3n/an/an/an/an/an/a
University of Innsbruck
Curated by ChEMBL
Assay Description
Inhibition of mPGES-1 in IL-1beta-stimulated human A549 cell microsomal membranes assessed as reduction in PGE2 formation incubated for 15 mins using...
Bioorg Med Chem 23: 4839-45 (2015)
BindingDB Entry DOI: 10.7270/Q2M90BF8