BDBM50360962 CHEMBL1935283
SMILES: CC(C)[C@H](NS(=O)(=O)c1ccc2c(c1)oc1ccc(cc21)N1CCOCC1)C(O)=O
InChI Key: InChIKey=YODOKYMGJFAIPQ-FQEVSTJZSA-N
Data: 1 IC50
Activity Spreadsheet -- Enzyme Inhibition Constant Data from BindingDB
Found 1 hit for monomerid = 50360962
Trg + Lig
Ki
nM
ΔG°
kcal/mole
IC50
nM
Kd
nM
EC50/IC50
nM
koff
s-1
kon
M-1s-1
pHTemp
°C
Matrix metalloproteinase-12 (MMP12)
(Homo sapiens (Human))
BDBM50360962
(CHEMBL1935283)
Show SMILES CC(C)[C@H](NS(=O)(=O)c1ccc2c(c1)oc1ccc(cc21)N1CCOCC1)C(O)=O |r|
Show InChI InChI=1S/C21H24N2O6S/c1-13(2)20(21(24)25)22-30(26,27)15-4-5-16-17-11-14(23-7-9-28-10-8-23)3-6-18(17)29-19(16)12-15/h3-6,11-13,20,22H,7-10H2,1-2H3,(H,24,25)/t20-/m0/s1
Reactome pathway
n/an/a 2.20n/an/an/an/an/an/a
Pfizer Inc.
Curated by ChEMBL
Assay Description
Inhibition of human MMP-12
Bioorg Med Chem Lett 22: 138-43 (2011)
Article DOI: 10.1016/j.bmcl.2011.11.046
BindingDB Entry DOI: 10.7270/Q2SJ1M20