BDBM50360967 CHEMBL1935288
SMILES: CC(C)[C@H](NS(=O)(=O)c1ccc2c(c1)oc1ccc(cc21)-c1ccc(C)s1)C(O)=O
InChI Key: InChIKey=DKEROQXIMVSLEZ-NRFANRHFSA-N
Data: 1 IC50
Activity Spreadsheet -- Enzyme Inhibition Constant Data from BindingDB
Found 1 hit for monomerid = 50360967
Trg + Lig
Ki
nM
ΔG°
kcal/mole
IC50
nM
Kd
nM
EC50/IC50
nM
koff
s-1
kon
M-1s-1
pHTemp
°C
Matrix metalloproteinase-12 (MMP12)
(Homo sapiens (Human))
BDBM50360967
(CHEMBL1935288)
Show SMILES CC(C)[C@H](NS(=O)(=O)c1ccc2c(c1)oc1ccc(cc21)-c1ccc(C)s1)C(O)=O |r|
Show InChI InChI=1S/C22H21NO5S2/c1-12(2)21(22(24)25)23-30(26,27)15-6-7-16-17-10-14(20-9-4-13(3)29-20)5-8-18(17)28-19(16)11-15/h4-12,21,23H,1-3H3,(H,24,25)/t21-/m0/s1
Reactome pathway
n/an/a 0.200n/an/an/an/an/an/a
Pfizer Inc.
Curated by ChEMBL
Assay Description
Inhibition of human MMP-12
Bioorg Med Chem Lett 22: 138-43 (2011)
Article DOI: 10.1016/j.bmcl.2011.11.046
BindingDB Entry DOI: 10.7270/Q2SJ1M20