BDBM50361004 CHEMBL1935441
SMILES: Cc1ccc(Cn2c(nc3ccccc23)[C@H]2CNCCO2)cc1
InChI Key: InChIKey=IGUBZXXWVQQSPY-GOSISDBHSA-N
Data: 1 KI  3 IC50
Activity Spreadsheet -- Enzyme Inhibition Constant Data from BindingDB
Found 4 hits for monomerid = 50361004
Trg + Lig
Ki
nM
ΔG°
kcal/mole
IC50
nM
Kd
nM
EC50/IC50
nM
koff
s-1
kon
M-1s-1
pHTemp
°C
Histamine H1 receptor
(Homo sapiens (Human))
BDBM50361004
(CHEMBL1935441)
Show SMILES Cc1ccc(Cn2c(nc3ccccc23)[C@H]2CNCCO2)cc1 |r|
Show InChI InChI=1S/C19H21N3O/c1-14-6-8-15(9-7-14)13-22-17-5-3-2-4-16(17)21-19(22)18-12-20-10-11-23-18/h2-9,18,20H,10-13H2,1H3/t18-/m1/s1
Reactome pathway
1n/an/an/an/an/an/an/an/a
Neurocrine Biosciences
Curated by ChEMBL
Assay Description
Antagonist activity at histamine H1 receptor
Bioorg Med Chem Lett 22: 421-6 (2011)
Article DOI: 10.1016/j.bmcl.2011.10.115
BindingDB Entry DOI: 10.7270/Q2J103KS
Cytochrome P450 3A4
(Homo sapiens (Human))
BDBM50361004
(CHEMBL1935441)
Show SMILES Cc1ccc(Cn2c(nc3ccccc23)[C@H]2CNCCO2)cc1 |r|
Show InChI InChI=1S/C19H21N3O/c1-14-6-8-15(9-7-14)13-22-17-5-3-2-4-16(17)21-19(22)18-12-20-10-11-23-18/h2-9,18,20H,10-13H2,1H3/t18-/m1/s1
Reactome pathway
n/an/a>2.00E+4n/an/an/an/an/an/a
Neurocrine Biosciences
Curated by ChEMBL
Assay Description
Inhibition of CYP3A4
Bioorg Med Chem Lett 22: 421-6 (2011)
Article DOI: 10.1016/j.bmcl.2011.10.115
BindingDB Entry DOI: 10.7270/Q2J103KS
Cytochrome P450 2D6
(Homo sapiens (Human))
BDBM50361004
(CHEMBL1935441)
Show SMILES Cc1ccc(Cn2c(nc3ccccc23)[C@H]2CNCCO2)cc1 |r|
Show InChI InChI=1S/C19H21N3O/c1-14-6-8-15(9-7-14)13-22-17-5-3-2-4-16(17)21-19(22)18-12-20-10-11-23-18/h2-9,18,20H,10-13H2,1H3/t18-/m1/s1
n/an/a 2.83E+4n/an/an/an/an/an/a
Neurocrine Biosciences
Curated by ChEMBL
Assay Description
Inhibition of CYP2D6
Bioorg Med Chem Lett 22: 421-6 (2011)
Article DOI: 10.1016/j.bmcl.2011.10.115
BindingDB Entry DOI: 10.7270/Q2J103KS
Potassium voltage-gated channel subfamily H member 2
(Homo sapiens (Human))
BDBM50361004
(CHEMBL1935441)
Show SMILES Cc1ccc(Cn2c(nc3ccccc23)[C@H]2CNCCO2)cc1 |r|
Show InChI InChI=1S/C19H21N3O/c1-14-6-8-15(9-7-14)13-22-17-5-3-2-4-16(17)21-19(22)18-12-20-10-11-23-18/h2-9,18,20H,10-13H2,1H3/t18-/m1/s1
Reactome pathway
n/an/a 2.30E+3n/an/an/an/an/an/a
Neurocrine Biosciences
Curated by ChEMBL
Assay Description
Inhibition of human Erg by whole cell patch clamp electrophysiology
Bioorg Med Chem Lett 22: 421-6 (2011)
Article DOI: 10.1016/j.bmcl.2011.10.115
BindingDB Entry DOI: 10.7270/Q2J103KS