BDBM50361046 CHEMBL1935585
SMILES: CC[C@H](COc1ccc2C(C)=C(CN3CC(C3)C(O)=O)CCc2c1)Cc1ccc(F)cc1
InChI Key: InChIKey=IVKLQMNIWSFZIG-IBGZPJMESA-N
Data: 2 EC50
Activity Spreadsheet -- Enzyme Inhibition Constant Data from BindingDB
Found 2 hits for monomerid = 50361046
Trg + Lig
Ki
nM
ΔG°
kcal/mole
IC50
nM
Kd
nM
EC50/IC50
nM
koff
s-1
kon
M-1s-1
pHTemp
°C
Sphingosine 1-phosphate receptor 3
(Homo sapiens (Human))
BDBM50361046
(CHEMBL1935585)
Show SMILES CC[C@H](COc1ccc2C(C)=C(CN3CC(C3)C(O)=O)CCc2c1)Cc1ccc(F)cc1 |r,t:10|
Show InChI InChI=1S/C27H32FNO3/c1-3-19(12-20-4-8-24(28)9-5-20)17-32-25-10-11-26-18(2)22(7-6-21(26)13-25)14-29-15-23(16-29)27(30)31/h4-5,8-11,13,19,23H,3,6-7,12,14-17H2,1-2H3,(H,30,31)/t19-/m0/s1
NCI pathway
Reactome pathway
n/an/an/an/a 2.93E+4n/an/an/an/a
Ono Pharmaceutical Co., Ltd
Curated by ChEMBL
Assay Description
Agonist activity at human S1P3 receptor expressed in CHO cells assessed as induction of intracellular calcium level
Bioorg Med Chem Lett 22: 144-8 (2011)
Article DOI: 10.1016/j.bmcl.2011.11.048
BindingDB Entry DOI: 10.7270/Q28G8M46
Sphingosine 1-phosphate receptor 1
(Homo sapiens (Human))
BDBM50361046
(CHEMBL1935585)
Show SMILES CC[C@H](COc1ccc2C(C)=C(CN3CC(C3)C(O)=O)CCc2c1)Cc1ccc(F)cc1 |r,t:10|
Show InChI InChI=1S/C27H32FNO3/c1-3-19(12-20-4-8-24(28)9-5-20)17-32-25-10-11-26-18(2)22(7-6-21(26)13-25)14-29-15-23(16-29)27(30)31/h4-5,8-11,13,19,23H,3,6-7,12,14-17H2,1-2H3,(H,30,31)/t19-/m0/s1
Reactome pathway
n/an/an/an/a 1.10n/an/an/an/a
Ono Pharmaceutical Co., Ltd
Curated by ChEMBL
Assay Description
Agonist activity at human S1P1 receptor expressed in CHO cells assessed as induction of intracellular calcium level
Bioorg Med Chem Lett 22: 144-8 (2011)
Article DOI: 10.1016/j.bmcl.2011.11.048
BindingDB Entry DOI: 10.7270/Q28G8M46