BDBM50361200 CHEMBL1934331
SMILES: CN1CCC(COc2ccc3c(Nc4ccc(NC(=O)Nc5cccc(F)c5)c(F)c4)ncnc3c2)CC1
InChI Key: InChIKey=JYIOHHMCRSLEOY-UHFFFAOYSA-N
Data: 1 IC50
Activity Spreadsheet -- Enzyme Inhibition Constant Data from BindingDB
Found 1 hit for monomerid = 50361200
Trg + Lig
Ki
nM
ΔG°
kcal/mole
IC50
nM
Kd
nM
EC50/IC50
nM
koff
s-1
kon
M-1s-1
pHTemp
°C
Vascular endothelial growth factor receptor 2
(Homo sapiens (Human))
BDBM50361200
(CHEMBL1934331)
Show SMILES CN1CCC(COc2ccc3c(Nc4ccc(NC(=O)Nc5cccc(F)c5)c(F)c4)ncnc3c2)CC1
Show InChI InChI=1S/C28H28F2N6O2/c1-36-11-9-18(10-12-36)16-38-22-6-7-23-26(15-22)31-17-32-27(23)33-21-5-8-25(24(30)14-21)35-28(37)34-20-4-2-3-19(29)13-20/h2-8,13-15,17-18H,9-12,16H2,1H3,(H,31,32,33)(H2,34,35,37)
NCI pathway
Reactome pathway
n/an/a 15n/an/an/an/an/an/a
Shenyang Pharmaceutical University
Curated by ChEMBL
Assay Description
Inhibition of human GST-tagged VEGFR2 intracellular domain using biotin-aminohexyl-EEEEYFELVAKKKK-NH2 as substrate after 30 mins by HTRF assay
Bioorg Med Chem Lett 22: 110-4 (2011)
Article DOI: 10.1016/j.bmcl.2011.11.061
BindingDB Entry DOI: 10.7270/Q2H132FD