BDBM50361203 CHEMBL1934333
SMILES: COc1cc2c(Nc3ccc(NC(=O)Nc4cccc(F)c4)c(F)c3)ncnc2cc1OCC1CCN(C)CC1
InChI Key: InChIKey=GXGHCRWDNOOYEU-UHFFFAOYSA-N
Data: 1 IC50
Activity Spreadsheet -- Enzyme Inhibition Constant Data from BindingDB
Found 1 hit for monomerid = 50361203
Trg + Lig
Ki
nM
ΔG°
kcal/mole
IC50
nM
Kd
nM
EC50/IC50
nM
koff
s-1
kon
M-1s-1
pHTemp
°C
Vascular endothelial growth factor receptor 2
(Homo sapiens (Human))
BDBM50361203
(CHEMBL1934333)
Show SMILES COc1cc2c(Nc3ccc(NC(=O)Nc4cccc(F)c4)c(F)c3)ncnc2cc1OCC1CCN(C)CC1
Show InChI InChI=1S/C29H30F2N6O3/c1-37-10-8-18(9-11-37)16-40-27-15-25-22(14-26(27)39-2)28(33-17-32-25)34-21-6-7-24(23(31)13-21)36-29(38)35-20-5-3-4-19(30)12-20/h3-7,12-15,17-18H,8-11,16H2,1-2H3,(H,32,33,34)(H2,35,36,38)
NCI pathway
Reactome pathway
n/an/a 17n/an/an/an/an/an/a
Shenyang Pharmaceutical University
Curated by ChEMBL
Assay Description
Inhibition of human GST-tagged VEGFR2 intracellular domain using biotin-aminohexyl-EEEEYFELVAKKKK-NH2 as substrate after 30 mins by HTRF assay
Bioorg Med Chem Lett 22: 110-4 (2011)
Article DOI: 10.1016/j.bmcl.2011.11.061
BindingDB Entry DOI: 10.7270/Q2H132FD