BDBM50361206 CHEMBL1934335
SMILES: COc1ccccc1-c1ccc2cnc(Nc3ccc(cc3)C3CCN(CC(N)=O)CC3)nn12
InChI Key: InChIKey=VSOBEWDEAFPUPX-UHFFFAOYSA-N
Data: 4 IC50
Activity Spreadsheet -- Enzyme Inhibition Constant Data from BindingDB
Found 4 hits for monomerid = 50361206
Trg + Lig
Ki
nM
ΔG°
kcal/mole
IC50
nM
Kd
nM
EC50/IC50
nM
koff
s-1
kon
M-1s-1
pHTemp
°C
Tyrosine-protein kinase JAK2
(Homo sapiens (Human))
BDBM50361206
(CHEMBL1934335)
Show SMILES COc1ccccc1-c1ccc2cnc(Nc3ccc(cc3)C3CCN(CC(N)=O)CC3)nn12
Show InChI InChI=1S/C26H28N6O2/c1-34-24-5-3-2-4-22(24)23-11-10-21-16-28-26(30-32(21)23)29-20-8-6-18(7-9-20)19-12-14-31(15-13-19)17-25(27)33/h2-11,16,19H,12-15,17H2,1H3,(H2,27,33)(H,29,30)
Reactome pathway
n/an/a 0.600n/an/an/an/an/an/a
Cephalon, Inc.
Curated by ChEMBL
Assay Description
Inhibition of human recombinant JAK2 expressed in baculovirus expression system after 20 mins by time resolved fluorescence assay
Bioorg Med Chem Lett 22: 133-7 (2011)
Article DOI: 10.1016/j.bmcl.2011.11.049
BindingDB Entry DOI: 10.7270/Q2C829R4
Focal adhesion kinase 1
(Homo sapiens (Human))
BDBM50361206
(CHEMBL1934335)
Show SMILES COc1ccccc1-c1ccc2cnc(Nc3ccc(cc3)C3CCN(CC(N)=O)CC3)nn12
Show InChI InChI=1S/C26H28N6O2/c1-34-24-5-3-2-4-22(24)23-11-10-21-16-28-26(30-32(21)23)29-20-8-6-18(7-9-20)19-12-14-31(15-13-19)17-25(27)33/h2-11,16,19H,12-15,17H2,1H3,(H2,27,33)(H,29,30)
NCI pathway
Reactome pathway
n/an/a 690n/an/an/an/an/an/a
Cephalon, Inc.
Curated by ChEMBL
Assay Description
Inhibition of FAK in human 293GT cells after 1 hr by luminescence-based spectrophotometry
Bioorg Med Chem Lett 22: 133-7 (2011)
Article DOI: 10.1016/j.bmcl.2011.11.049
BindingDB Entry DOI: 10.7270/Q2C829R4
Tyrosine-protein kinase JAK2
(Homo sapiens (Human))
BDBM50361206
(CHEMBL1934335)
Show SMILES COc1ccccc1-c1ccc2cnc(Nc3ccc(cc3)C3CCN(CC(N)=O)CC3)nn12
Show InChI InChI=1S/C26H28N6O2/c1-34-24-5-3-2-4-22(24)23-11-10-21-16-28-26(30-32(21)23)29-20-8-6-18(7-9-20)19-12-14-31(15-13-19)17-25(27)33/h2-11,16,19H,12-15,17H2,1H3,(H2,27,33)(H,29,30)
Reactome pathway
n/an/a 41n/an/an/an/an/an/a
Cephalon, Inc.
Curated by ChEMBL
Assay Description
Inhibition of human recombinant JAK2 expressed in baculovirus expression system after 20 mins by time resolved fluorescence assay
Bioorg Med Chem Lett 22: 133-7 (2011)
Article DOI: 10.1016/j.bmcl.2011.11.049
BindingDB Entry DOI: 10.7270/Q2C829R4
Focal adhesion kinase 1
(Homo sapiens (Human))
BDBM50361206
(CHEMBL1934335)
Show SMILES COc1ccccc1-c1ccc2cnc(Nc3ccc(cc3)C3CCN(CC(N)=O)CC3)nn12
Show InChI InChI=1S/C26H28N6O2/c1-34-24-5-3-2-4-22(24)23-11-10-21-16-28-26(30-32(21)23)29-20-8-6-18(7-9-20)19-12-14-31(15-13-19)17-25(27)33/h2-11,16,19H,12-15,17H2,1H3,(H2,27,33)(H,29,30)
NCI pathway
Reactome pathway
n/an/a 55n/an/an/an/an/an/a
Cephalon, Inc.
Curated by ChEMBL
Assay Description
Inhibition of human recombinant FAK expressed in baculovirus expression system after 30 mins by time resolved fluorescence assay
Bioorg Med Chem Lett 22: 133-7 (2011)
Article DOI: 10.1016/j.bmcl.2011.11.049
BindingDB Entry DOI: 10.7270/Q2C829R4