BDBM50361339 CHEMBL1933841
SMILES: CCCCCS(=O)(=O)NC(=O)\C=C\c1cc(OC(C)C)nn1Cc1ccc(cc1Cl)C(F)(F)F
InChI Key: InChIKey=XBWPSVQIRYMIBM-MDZDMXLPSA-N
Data: 1 IC50  3 EC50
Activity Spreadsheet -- Enzyme Inhibition Constant Data from BindingDB
Found 4 hits for monomerid = 50361339
Trg + Lig
Ki
nM
ΔG°
kcal/mole
IC50
nM
Kd
nM
EC50/IC50
nM
koff
s-1
kon
M-1s-1
pHTemp
°C
Peroxisome proliferator-activated receptor
(Homo sapiens (Human))
BDBM50361339
(CHEMBL1933841)
Show SMILES CCCCCS(=O)(=O)NC(=O)\C=C\c1cc(OC(C)C)nn1Cc1ccc(cc1Cl)C(F)(F)F
Show InChI InChI=1S/C22H27ClF3N3O4S/c1-4-5-6-11-34(31,32)28-20(30)10-9-18-13-21(33-15(2)3)27-29(18)14-16-7-8-17(12-19(16)23)22(24,25)26/h7-10,12-13,15H,4-6,11,14H2,1-3H3,(H,28,30)/b10-9+
NCI pathway
Reactome pathway
n/an/a 23n/an/an/an/an/an/a
Takeda Pharmaceutical Company Ltd
Curated by ChEMBL
Assay Description
Displacement of [3H]-AD-5061 from human GST-tagged PPARgamma
Bioorg Med Chem 20: 714-33 (2012)
Article DOI: 10.1016/j.bmc.2011.12.008
BindingDB Entry DOI: 10.7270/Q2PK0GK3
Peroxisome proliferator-activated receptor
(Homo sapiens (Human))
BDBM50361339
(CHEMBL1933841)
Show SMILES CCCCCS(=O)(=O)NC(=O)\C=C\c1cc(OC(C)C)nn1Cc1ccc(cc1Cl)C(F)(F)F
Show InChI InChI=1S/C22H27ClF3N3O4S/c1-4-5-6-11-34(31,32)28-20(30)10-9-18-13-21(33-15(2)3)27-29(18)14-16-7-8-17(12-19(16)23)22(24,25)26/h7-10,12-13,15H,4-6,11,14H2,1-3H3,(H,28,30)/b10-9+
NCI pathway
Reactome pathway
n/an/an/an/a 9.30n/an/an/an/a
Takeda Pharmaceutical Company Ltd
Curated by ChEMBL
Assay Description
Agonist activity at full length human PPARgamma1 transfected in human CHOK1 cells co expressing RXRalpha and PPRE after 1 day by luciferase reporter ...
Bioorg Med Chem 20: 714-33 (2012)
Article DOI: 10.1016/j.bmc.2011.12.008
BindingDB Entry DOI: 10.7270/Q2PK0GK3
Peroxisome proliferator-activated receptor alpha (PPAR alpha)
(Homo sapiens (Human))
BDBM50361339
(CHEMBL1933841)
Show SMILES CCCCCS(=O)(=O)NC(=O)\C=C\c1cc(OC(C)C)nn1Cc1ccc(cc1Cl)C(F)(F)F
Show InChI InChI=1S/C22H27ClF3N3O4S/c1-4-5-6-11-34(31,32)28-20(30)10-9-18-13-21(33-15(2)3)27-29(18)14-16-7-8-17(12-19(16)23)22(24,25)26/h7-10,12-13,15H,4-6,11,14H2,1-3H3,(H,28,30)/b10-9+
n/an/an/an/a>1.00E+4n/an/an/an/a
Takeda Pharmaceutical Company Ltd
Curated by ChEMBL
Assay Description
Agonist activity at human PPARalpha expressed in COS-1 cells after 1 day by luciferase reporter gene transactivation assay
Bioorg Med Chem 20: 714-33 (2012)
Article DOI: 10.1016/j.bmc.2011.12.008
BindingDB Entry DOI: 10.7270/Q2PK0GK3
Peroxisome proliferator-activated receptor delta
(Homo sapiens (Human))
BDBM50361339
(CHEMBL1933841)
Show SMILES CCCCCS(=O)(=O)NC(=O)\C=C\c1cc(OC(C)C)nn1Cc1ccc(cc1Cl)C(F)(F)F
Show InChI InChI=1S/C22H27ClF3N3O4S/c1-4-5-6-11-34(31,32)28-20(30)10-9-18-13-21(33-15(2)3)27-29(18)14-16-7-8-17(12-19(16)23)22(24,25)26/h7-10,12-13,15H,4-6,11,14H2,1-3H3,(H,28,30)/b10-9+
n/an/an/an/a>1.00E+4n/an/an/an/a
Takeda Pharmaceutical Company Ltd
Curated by ChEMBL
Assay Description
Agonist activity at human PPARdelta expressed in COS-1 cells after 2 days by luciferase reporter gene transactivation assay
Bioorg Med Chem 20: 714-33 (2012)
Article DOI: 10.1016/j.bmc.2011.12.008
BindingDB Entry DOI: 10.7270/Q2PK0GK3