BDBM50361391 CHEMBL1934197
SMILES: [#6]-[#8]-c1c2ccoc2c(-[#8]-[#6]\[#6]=[#6](/[#6])-[#6]-[#6]\[#6]=[#6](\[#6])-[#6])c2oc(=O)ccc12
InChI Key: InChIKey=CTPXXQMJFXTTQZ-XNTDXEJSSA-N
Data: 1 IC50
Activity Spreadsheet -- Enzyme Inhibition Constant Data from BindingDB
Found 1 hit for monomerid = 50361391
Trg + Lig
Ki
nM
ΔG°
kcal/mole
IC50
nM
Kd
nM
EC50/IC50
nM
koff
s-1
kon
M-1s-1
pHTemp
°C
Beta-secretase 1
(Homo sapiens (Human))
BDBM50361391
(CHEMBL1934197)
Show SMILES [#6]-[#8]-c1c2ccoc2c(-[#8]-[#6]\[#6]=[#6](/[#6])-[#6]-[#6]\[#6]=[#6](\[#6])-[#6])c2oc(=O)ccc12
Show InChI InChI=1S/C22H24O5/c1-14(2)6-5-7-15(3)10-12-26-22-20-17(11-13-25-20)19(24-4)16-8-9-18(23)27-21(16)22/h6,8-11,13H,5,7,12H2,1-4H3/b15-10+
n/an/a 1.11E+4n/an/an/an/an/an/a
Kinki University
Curated by ChEMBL
Assay Description
Inhibition of recombinant human BACE1 using Rh-EVNLDAEFK as substrate after 60 mins by fluorescence quenching assay
Bioorg Med Chem 20: 784-8 (2012)
Article DOI: 10.1016/j.bmc.2011.12.002
BindingDB Entry DOI: 10.7270/Q2F47PKK