BDBM50361472 CHEMBL1938896
SMILES: OC(=O)c1ccnc(C(O)=O)c1Nc1ccccc1F
InChI Key: InChIKey=ZSDLAGPKXVKDRU-UHFFFAOYSA-N
Data: 2 IC50
Activity Spreadsheet -- Enzyme Inhibition Constant Data from BindingDB
Found 2 hits for monomerid = 50361472
Trg + Lig
Ki
nM
ΔG°
kcal/mole
IC50
nM
Kd
nM
EC50/IC50
nM
koff
s-1
kon
M-1s-1
pHTemp
°C
Histone Lysine Demethylase
(Homo sapiens (Human))
BDBM50361472
(CHEMBL1938896)
Show SMILES OC(=O)c1ccnc(C(O)=O)c1Nc1ccccc1F
Show InChI InChI=1S/C13H9FN2O4/c14-8-3-1-2-4-9(8)16-10-7(12(17)18)5-6-15-11(10)13(19)20/h1-6,16H,(H,17,18)(H,19,20)
n/an/a 2.50E+3n/an/an/an/an/an/a
TBA
Curated by ChEMBL
Assay Description
Inhibition of human JMJD2E
Eur J Med Chem 56: 179-194 (2012)
Article DOI: 10.1016/j.ejmech.2012.08.010
BindingDB Entry DOI: 10.7270/Q2TQ62NX
Egl nine homolog 1
(Homo sapiens (Human))
BDBM50361472
(CHEMBL1938896)
Show SMILES OC(=O)c1ccnc(C(O)=O)c1Nc1ccccc1F
Show InChI InChI=1S/C13H9FN2O4/c14-8-3-1-2-4-9(8)16-10-7(12(17)18)5-6-15-11(10)13(19)20/h1-6,16H,(H,17,18)(H,19,20)
Reactome pathway
n/an/a>4.00E+5n/an/an/an/an/an/a
Kyoto Prefectural University of Medicine
Curated by ChEMBL
Assay Description
Inhibition of PHD2
J Med Chem 54: 8236-50 (2011)
Article DOI: 10.1021/jm201048w
BindingDB Entry DOI: 10.7270/Q2D50NFR