BDBM50361601 CHEMBL1939846
SMILES: CC(C)[C@H]1N(CC(=O)N(O)C1=O)S(=O)(=O)c1ccc(Oc2ccccc2)cc1
InChI Key: InChIKey=RQCBSNJRFVZHOS-GOSISDBHSA-N
Data: 10 IC50
Activity Spreadsheet -- Enzyme Inhibition Constant Data from BindingDB
Found 10 hits for monomerid = 50361601
Trg + Lig
Ki
nM
ΔG°
kcal/mole
IC50
nM
Kd
nM
EC50/IC50
nM
koff
s-1
kon
M-1s-1
pHTemp
°C
Matrix metalloproteinase-14 (MMP14)
(Homo sapiens (Human))
BDBM50361601
(CHEMBL1939846)
Show SMILES CC(C)[C@H]1N(CC(=O)N(O)C1=O)S(=O)(=O)c1ccc(Oc2ccccc2)cc1 |r|
Show InChI InChI=1S/C19H20N2O6S/c1-13(2)18-19(23)21(24)17(22)12-20(18)28(25,26)16-10-8-15(9-11-16)27-14-6-4-3-5-7-14/h3-11,13,18,24H,12H2,1-2H3/t18-/m1/s1
n/an/a 83n/an/an/an/an/an/a
Instituto Superior T£cnico
Curated by ChEMBL
Assay Description
Inhibition of human recombinant MMP14 using Mca-Lys-Pro-Leu-Gly-Leu-Dap(Dnp)-Ala-Arg-NH2 as substrate preincubated for 4 hrs measured every 15 secs f...
J Med Chem 54: 8289-98 (2011)
Article DOI: 10.1021/jm200593b
BindingDB Entry DOI: 10.7270/Q2MP53QN
Matrix metalloproteinase-9
(Homo sapiens (Human))
BDBM50361601
(CHEMBL1939846)
Show SMILES CC(C)[C@H]1N(CC(=O)N(O)C1=O)S(=O)(=O)c1ccc(Oc2ccccc2)cc1 |r|
Show InChI InChI=1S/C19H20N2O6S/c1-13(2)18-19(23)21(24)17(22)12-20(18)28(25,26)16-10-8-15(9-11-16)27-14-6-4-3-5-7-14/h3-11,13,18,24H,12H2,1-2H3/t18-/m1/s1
Reactome pathway
n/an/a 30n/an/an/an/an/an/a
Instituto Superior T£cnico
Curated by ChEMBL
Assay Description
Inhibition of human recombinant MMP9 using Mca-Lys-Pro-Leu-Gly-Leu-Dap(Dnp)-Ala-Arg-NH2 as substrate preincubated for 4 hrs measured every 15 secs fo...
J Med Chem 54: 8289-98 (2011)
Article DOI: 10.1021/jm200593b
BindingDB Entry DOI: 10.7270/Q2MP53QN
Interstitial collagenase
(Homo sapiens (Human))
BDBM50361601
(CHEMBL1939846)
Show SMILES CC(C)[C@H]1N(CC(=O)N(O)C1=O)S(=O)(=O)c1ccc(Oc2ccccc2)cc1 |r|
Show InChI InChI=1S/C19H20N2O6S/c1-13(2)18-19(23)21(24)17(22)12-20(18)28(25,26)16-10-8-15(9-11-16)27-14-6-4-3-5-7-14/h3-11,13,18,24H,12H2,1-2H3/t18-/m1/s1
Reactome pathway
n/an/a 1.60E+3n/an/an/an/an/an/a
Instituto Superior T£cnico
Curated by ChEMBL
Assay Description
Inhibition of MMP1 using Mca-Lys-Pro-Leu-Gly-Leu-Dap(Dnp)-Ala-Arg-NH2 as substrate preincubated for 4 hrs measured every 15 secs for 20 mins by fluor...
J Med Chem 54: 8289-98 (2011)
Article DOI: 10.1021/jm200593b
BindingDB Entry DOI: 10.7270/Q2MP53QN
72 kDa type IV collagenase
(Homo sapiens (Human))
BDBM50361601
(CHEMBL1939846)
Show SMILES CC(C)[C@H]1N(CC(=O)N(O)C1=O)S(=O)(=O)c1ccc(Oc2ccccc2)cc1 |r|
Show InChI InChI=1S/C19H20N2O6S/c1-13(2)18-19(23)21(24)17(22)12-20(18)28(25,26)16-10-8-15(9-11-16)27-14-6-4-3-5-7-14/h3-11,13,18,24H,12H2,1-2H3/t18-/m1/s1
Reactome pathway
n/an/a 30n/an/an/an/an/an/a
Instituto Superior T£cnico
Curated by ChEMBL
Assay Description
Inhibition of human recombinant MMP2 using Mca-Lys-Pro-Leu-Gly-Leu-Dap(Dnp)-Ala-Arg-NH2 as substrate preincubated for 4 hrs measured every 15 secs fo...
J Med Chem 54: 8289-98 (2011)
Article DOI: 10.1021/jm200593b
BindingDB Entry DOI: 10.7270/Q2MP53QN
Disintegrin and metalloproteinase domain-containing protein 17
(Homo sapiens (Human))
BDBM50361601
(CHEMBL1939846)
Show SMILES CC(C)[C@H]1N(CC(=O)N(O)C1=O)S(=O)(=O)c1ccc(Oc2ccccc2)cc1 |r|
Show InChI InChI=1S/C19H20N2O6S/c1-13(2)18-19(23)21(24)17(22)12-20(18)28(25,26)16-10-8-15(9-11-16)27-14-6-4-3-5-7-14/h3-11,13,18,24H,12H2,1-2H3/t18-/m1/s1
Reactome pathway
n/an/a 1.00E+4n/an/an/an/an/an/a
Instituto Superior T£cnico
Curated by ChEMBL
Assay Description
Inhibition of TACE using Mca-Lys-Pro-Leu-Gly-Leu-Dap(Dnp)-Ala-Arg-NH2 as substrate preincubated for 4 hrs measured every 15 secs for 20 mins by fluor...
J Med Chem 54: 8289-98 (2011)
Article DOI: 10.1021/jm200593b
BindingDB Entry DOI: 10.7270/Q2MP53QN
Neutrophil collagenase
(Homo sapiens (Human))
BDBM50361601
(CHEMBL1939846)
Show SMILES CC(C)[C@H]1N(CC(=O)N(O)C1=O)S(=O)(=O)c1ccc(Oc2ccccc2)cc1 |r|
Show InChI InChI=1S/C19H20N2O6S/c1-13(2)18-19(23)21(24)17(22)12-20(18)28(25,26)16-10-8-15(9-11-16)27-14-6-4-3-5-7-14/h3-11,13,18,24H,12H2,1-2H3/t18-/m1/s1
Reactome pathway
n/an/a 21n/an/an/an/an/an/a
Instituto Superior T£cnico
Curated by ChEMBL
Assay Description
Inhibition of human recombinant MMP8 using Mca-Lys-Pro-Leu-Gly-Leu-Dap(Dnp)-Ala-Arg-NH2 as substrate preincubated for 4 hrs measured every 15 secs fo...
J Med Chem 54: 8289-98 (2011)
Article DOI: 10.1021/jm200593b
BindingDB Entry DOI: 10.7270/Q2MP53QN
Matrix metalloproteinase-12 (MMP12)
(Homo sapiens (Human))
BDBM50361601
(CHEMBL1939846)
Show SMILES CC(C)[C@H]1N(CC(=O)N(O)C1=O)S(=O)(=O)c1ccc(Oc2ccccc2)cc1 |r|
Show InChI InChI=1S/C19H20N2O6S/c1-13(2)18-19(23)21(24)17(22)12-20(18)28(25,26)16-10-8-15(9-11-16)27-14-6-4-3-5-7-14/h3-11,13,18,24H,12H2,1-2H3/t18-/m1/s1
Reactome pathway
n/an/a 23n/an/an/an/an/an/a
Instituto Superior T£cnico
Curated by ChEMBL
Assay Description
Inhibition of MMP12 using Mca-Lys-Pro-Leu-Gly-Leu-Dap(Dnp)-Ala-Arg-NH2 as substrate preincubated for 4 hrs measured every 15 secs for 20 mins by fluo...
J Med Chem 54: 8289-98 (2011)
Article DOI: 10.1021/jm200593b
BindingDB Entry DOI: 10.7270/Q2MP53QN
Collagenase 3
(Homo sapiens (Human))
BDBM50361601
(CHEMBL1939846)
Show SMILES CC(C)[C@H]1N(CC(=O)N(O)C1=O)S(=O)(=O)c1ccc(Oc2ccccc2)cc1 |r|
Show InChI InChI=1S/C19H20N2O6S/c1-13(2)18-19(23)21(24)17(22)12-20(18)28(25,26)16-10-8-15(9-11-16)27-14-6-4-3-5-7-14/h3-11,13,18,24H,12H2,1-2H3/t18-/m1/s1
NCI pathway
Reactome pathway
n/an/a 9.5n/an/an/an/an/an/a
Instituto Superior T£cnico
Curated by ChEMBL
Assay Description
Inhibition of MMP13 using Mca-Lys-Pro-Leu-Gly-Leu-Dap(Dnp)-Ala-Arg-NH2 as substrate preincubated for 4 hrs measured every 15 secs for 20 mins by fluo...
J Med Chem 54: 8289-98 (2011)
Article DOI: 10.1021/jm200593b
BindingDB Entry DOI: 10.7270/Q2MP53QN
Matrix metalloproteinase 16
(Homo sapiens (Human))
BDBM50361601
(CHEMBL1939846)
Show SMILES CC(C)[C@H]1N(CC(=O)N(O)C1=O)S(=O)(=O)c1ccc(Oc2ccccc2)cc1 |r|
Show InChI InChI=1S/C19H20N2O6S/c1-13(2)18-19(23)21(24)17(22)12-20(18)28(25,26)16-10-8-15(9-11-16)27-14-6-4-3-5-7-14/h3-11,13,18,24H,12H2,1-2H3/t18-/m1/s1
Reactome pathway
n/an/a 39n/an/an/an/an/an/a
Instituto Superior T£cnico
Curated by ChEMBL
Assay Description
Inhibition of human recombinant MMP16 using Mca-Lys-Pro-Leu-Gly-Leu-Dap(Dnp)-Ala-Arg-NH2 as substrate preincubated for 4 hrs measured every 15 secs f...
J Med Chem 54: 8289-98 (2011)
Article DOI: 10.1021/jm200593b
BindingDB Entry DOI: 10.7270/Q2MP53QN
Stromelysin-1
(Homo sapiens (Human))
BDBM50361601
(CHEMBL1939846)
Show SMILES CC(C)[C@H]1N(CC(=O)N(O)C1=O)S(=O)(=O)c1ccc(Oc2ccccc2)cc1 |r|
Show InChI InChI=1S/C19H20N2O6S/c1-13(2)18-19(23)21(24)17(22)12-20(18)28(25,26)16-10-8-15(9-11-16)27-14-6-4-3-5-7-14/h3-11,13,18,24H,12H2,1-2H3/t18-/m1/s1
Reactome pathway
n/an/a 220n/an/an/an/an/an/a
Instituto Superior T£cnico
Curated by ChEMBL
Assay Description
Inhibition of MMP3 using Mca-Arg-Pro-Lys-Pro-Val-Glu-Nva-Trp-Arg-Lys(Dnp)-NH2 as substrate preincubated for 4 hrs measured every 15 secs for 20 mins ...
J Med Chem 54: 8289-98 (2011)
Article DOI: 10.1021/jm200593b
BindingDB Entry DOI: 10.7270/Q2MP53QN