BDBM50361639 CHEMBL1371684
SMILES: Cc1ccc(CSc2nc3CCCc3c(=O)[nH]2)cc1
InChI Key: InChIKey=SEZPRMPVJMVCBV-UHFFFAOYSA-N
Data: 2 KI  13 IC50
PDB links: 1 PDB ID matches this monomer.
Activity Spreadsheet -- Enzyme Inhibition Constant Data from BindingDB
Found 15 hits for monomerid = 50361639
Trg + Lig
Ki
nM
ΔG°
kcal/mole
IC50
nM
Kd
nM
EC50/IC50
nM
koff
s-1
kon
M-1s-1
pHTemp
°C
Collagenase 3
(Homo sapiens (Human))
BDBM50361639
(CHEMBL1371684)
Show SMILES Cc1ccc(CSc2nc3CCCc3c(=O)[nH]2)cc1
Show InChI InChI=1S/C15H16N2OS/c1-10-5-7-11(8-6-10)9-19-15-16-13-4-2-3-12(13)14(18)17-15/h5-8H,2-4,9H2,1H3,(H,16,17,18)
NCI pathway
Reactome pathway
800n/an/an/an/an/an/an/an/a
Department of Chemistry, Scripps Florida , 130 Scripps Way, Jupiter, Florida 33458, United States.
Curated by ChEMBL
Assay Description
Inhibition of full length recombinant human MMP13 expressed in mouse NSO cells using varying levels of fTHP-15 as substrate preincubated for 30 mins ...
J Med Chem 60: 5816-5825 (2017)
Article DOI: 10.1021/acs.jmedchem.7b00514
BindingDB Entry DOI: 10.7270/Q23F4RTD
3D
3D Structure (crystal)
Collagenase 3
(Homo sapiens (Human))
BDBM50361639
(CHEMBL1371684)
Show SMILES Cc1ccc(CSc2nc3CCCc3c(=O)[nH]2)cc1
Show InChI InChI=1S/C15H16N2OS/c1-10-5-7-11(8-6-10)9-19-15-16-13-4-2-3-12(13)14(18)17-15/h5-8H,2-4,9H2,1H3,(H,16,17,18)
NCI pathway
Reactome pathway
824n/an/an/an/an/an/an/an/a
Scripps Florida
Curated by ChEMBL
Assay Description
Noncompetitive inhibition of human full length recombinant MMP13 using triple-helical fTHP-15 as substrate by Lineweaver-Burk plot analysis
Bioorg Med Chem Lett 21: 7180-4 (2011)
Article DOI: 10.1016/j.bmcl.2011.09.077
BindingDB Entry DOI: 10.7270/Q27D2VKN
3D
3D Structure (crystal)
Cytochrome P450 2B6
(Homo sapiens (Human))
BDBM50361639
(CHEMBL1371684)
Show SMILES Cc1ccc(CSc2nc3CCCc3c(=O)[nH]2)cc1
Show InChI InChI=1S/C15H16N2OS/c1-10-5-7-11(8-6-10)9-19-15-16-13-4-2-3-12(13)14(18)17-15/h5-8H,2-4,9H2,1H3,(H,16,17,18)
n/an/a>2.00E+4n/an/an/an/an/an/a
Translational Research Institute
Curated by ChEMBL
Assay Description
Inhibition of CYP2B6 (unknown origin) using bupropion substrate
J Med Chem 57: 9598-611 (2014)
Article DOI: 10.1021/jm501284e
BindingDB Entry DOI: 10.7270/Q2P55Q3G
Cytochrome P450 2C8
(Homo sapiens (Human))
BDBM50361639
(CHEMBL1371684)
Show SMILES Cc1ccc(CSc2nc3CCCc3c(=O)[nH]2)cc1
Show InChI InChI=1S/C15H16N2OS/c1-10-5-7-11(8-6-10)9-19-15-16-13-4-2-3-12(13)14(18)17-15/h5-8H,2-4,9H2,1H3,(H,16,17,18)
n/an/a>2.00E+4n/an/an/an/an/an/a
Translational Research Institute
Curated by ChEMBL
Assay Description
Inhibition of CYP2C8 (unknown origin) using amodiaquine substrate
J Med Chem 57: 9598-611 (2014)
Article DOI: 10.1021/jm501284e
BindingDB Entry DOI: 10.7270/Q2P55Q3G
Cytochrome P450 2C9
(Homo sapiens (Human))
BDBM50361639
(CHEMBL1371684)
Show SMILES Cc1ccc(CSc2nc3CCCc3c(=O)[nH]2)cc1
Show InChI InChI=1S/C15H16N2OS/c1-10-5-7-11(8-6-10)9-19-15-16-13-4-2-3-12(13)14(18)17-15/h5-8H,2-4,9H2,1H3,(H,16,17,18)
Reactome pathway
n/an/a 8.80E+3n/an/an/an/an/an/a
Translational Research Institute
Curated by ChEMBL
Assay Description
Inhibition of CYP2C9 (unknown origin) using diclofenac substrate
J Med Chem 57: 9598-611 (2014)
Article DOI: 10.1021/jm501284e
BindingDB Entry DOI: 10.7270/Q2P55Q3G
Cytochrome P450 2C19
(Homo sapiens (Human))
BDBM50361639
(CHEMBL1371684)
Show SMILES Cc1ccc(CSc2nc3CCCc3c(=O)[nH]2)cc1
Show InChI InChI=1S/C15H16N2OS/c1-10-5-7-11(8-6-10)9-19-15-16-13-4-2-3-12(13)14(18)17-15/h5-8H,2-4,9H2,1H3,(H,16,17,18)
Reactome pathway
n/an/a 7.90E+3n/an/an/an/an/an/a
Translational Research Institute
Curated by ChEMBL
Assay Description
Inhibition of CYP2C19 (unknown origin) using (S)-mephentoin substrate
J Med Chem 57: 9598-611 (2014)
Article DOI: 10.1021/jm501284e
BindingDB Entry DOI: 10.7270/Q2P55Q3G
Cytochrome P450 2D6
(Homo sapiens (Human))
BDBM50361639
(CHEMBL1371684)
Show SMILES Cc1ccc(CSc2nc3CCCc3c(=O)[nH]2)cc1
Show InChI InChI=1S/C15H16N2OS/c1-10-5-7-11(8-6-10)9-19-15-16-13-4-2-3-12(13)14(18)17-15/h5-8H,2-4,9H2,1H3,(H,16,17,18)
n/an/a>2.00E+4n/an/an/an/an/an/a
Translational Research Institute
Curated by ChEMBL
Assay Description
Inhibition of CYP2D6 (unknown origin) using dextromethophan substrate
J Med Chem 57: 9598-611 (2014)
Article DOI: 10.1021/jm501284e
BindingDB Entry DOI: 10.7270/Q2P55Q3G
Cytochrome P450 3A4
(Homo sapiens (Human))
BDBM50361639
(CHEMBL1371684)
Show SMILES Cc1ccc(CSc2nc3CCCc3c(=O)[nH]2)cc1
Show InChI InChI=1S/C15H16N2OS/c1-10-5-7-11(8-6-10)9-19-15-16-13-4-2-3-12(13)14(18)17-15/h5-8H,2-4,9H2,1H3,(H,16,17,18)
Reactome pathway
n/an/a>2.00E+4n/an/an/an/an/an/a
Translational Research Institute
Curated by ChEMBL
Assay Description
Inhibition of CYP3A4 (unknown origin) using midazolam substrate
J Med Chem 57: 9598-611 (2014)
Article DOI: 10.1021/jm501284e
BindingDB Entry DOI: 10.7270/Q2P55Q3G
Cytochrome P450 3A4
(Homo sapiens (Human))
BDBM50361639
(CHEMBL1371684)
Show SMILES Cc1ccc(CSc2nc3CCCc3c(=O)[nH]2)cc1
Show InChI InChI=1S/C15H16N2OS/c1-10-5-7-11(8-6-10)9-19-15-16-13-4-2-3-12(13)14(18)17-15/h5-8H,2-4,9H2,1H3,(H,16,17,18)
Reactome pathway
n/an/a>2.00E+4n/an/an/an/an/an/a
Translational Research Institute
Curated by ChEMBL
Assay Description
Inhibition of CYP3A4 (unknown origin) using testosterone substrate
J Med Chem 57: 9598-611 (2014)
Article DOI: 10.1021/jm501284e
BindingDB Entry DOI: 10.7270/Q2P55Q3G
Cytochrome P450 1A
(Homo sapiens (Human))
BDBM50361639
(CHEMBL1371684)
Show SMILES Cc1ccc(CSc2nc3CCCc3c(=O)[nH]2)cc1
Show InChI InChI=1S/C15H16N2OS/c1-10-5-7-11(8-6-10)9-19-15-16-13-4-2-3-12(13)14(18)17-15/h5-8H,2-4,9H2,1H3,(H,16,17,18)
Reactome pathway
n/an/a 3.70E+3n/an/an/an/an/an/a
Translational Research Institute
Curated by ChEMBL
Assay Description
Inhibition of CYP1A2 (unknown origin) using tacrin substrate
J Med Chem 57: 9598-611 (2014)
Article DOI: 10.1021/jm501284e
BindingDB Entry DOI: 10.7270/Q2P55Q3G
Interstitial collagenase
(Homo sapiens (Human))
BDBM50361639
(CHEMBL1371684)
Show SMILES Cc1ccc(CSc2nc3CCCc3c(=O)[nH]2)cc1
Show InChI InChI=1S/C15H16N2OS/c1-10-5-7-11(8-6-10)9-19-15-16-13-4-2-3-12(13)14(18)17-15/h5-8H,2-4,9H2,1H3,(H,16,17,18)
Reactome pathway
n/an/a>4.00E+4n/an/an/an/an/an/a
Scripps Florida
Curated by ChEMBL
Assay Description
Inhibition of MMP1 expressed in Escherichia coli using triple-helical fTHP-15 as substrate after 4 hrs by FRET assay
Bioorg Med Chem Lett 21: 7180-4 (2011)
Article DOI: 10.1016/j.bmcl.2011.09.077
BindingDB Entry DOI: 10.7270/Q27D2VKN
Neutrophil collagenase
(Homo sapiens (Human))
BDBM50361639
(CHEMBL1371684)
Show SMILES Cc1ccc(CSc2nc3CCCc3c(=O)[nH]2)cc1
Show InChI InChI=1S/C15H16N2OS/c1-10-5-7-11(8-6-10)9-19-15-16-13-4-2-3-12(13)14(18)17-15/h5-8H,2-4,9H2,1H3,(H,16,17,18)
Reactome pathway
n/an/a>4.00E+4n/an/an/an/an/an/a
Scripps Florida
Curated by ChEMBL
Assay Description
Inhibition of MMP8 expressed in CHO-K1 cells using triple-helical fTHP-15 as substrate after 4 hrs by FRET assay
Bioorg Med Chem Lett 21: 7180-4 (2011)
Article DOI: 10.1016/j.bmcl.2011.09.077
BindingDB Entry DOI: 10.7270/Q27D2VKN
Collagenase 3
(Homo sapiens (Human))
BDBM50361639
(CHEMBL1371684)
Show SMILES Cc1ccc(CSc2nc3CCCc3c(=O)[nH]2)cc1
Show InChI InChI=1S/C15H16N2OS/c1-10-5-7-11(8-6-10)9-19-15-16-13-4-2-3-12(13)14(18)17-15/h5-8H,2-4,9H2,1H3,(H,16,17,18)
NCI pathway
Reactome pathway
n/an/a 2.40E+3n/an/an/an/an/an/a
Department of Chemistry, Scripps Florida , 130 Scripps Way, Jupiter, Florida 33458, United States.
Curated by ChEMBL
Assay Description
Inhibition of full length recombinant human MMP13 expressed in mouse NSO cells using fTHP-15 as substrate preincubated for 30 mins followed by substr...
J Med Chem 60: 5816-5825 (2017)
Article DOI: 10.1021/acs.jmedchem.7b00514
BindingDB Entry DOI: 10.7270/Q23F4RTD
3D
3D Structure (crystal)
Collagenase 3
(Homo sapiens (Human))
BDBM50361639
(CHEMBL1371684)
Show SMILES Cc1ccc(CSc2nc3CCCc3c(=O)[nH]2)cc1
Show InChI InChI=1S/C15H16N2OS/c1-10-5-7-11(8-6-10)9-19-15-16-13-4-2-3-12(13)14(18)17-15/h5-8H,2-4,9H2,1H3,(H,16,17,18)
NCI pathway
Reactome pathway
n/an/a 2.40E+3n/an/an/an/an/an/a
Translational Research Institute
Curated by ChEMBL
Assay Description
Non-competitive inhibition of full-length recombinant human MMP-13 assessed as fTHP-15 substrate hydrolysis
J Med Chem 57: 9598-611 (2014)
Article DOI: 10.1021/jm501284e
BindingDB Entry DOI: 10.7270/Q2P55Q3G
3D
3D Structure (crystal)
Collagenase 3
(Homo sapiens (Human))
BDBM50361639
(CHEMBL1371684)
Show SMILES Cc1ccc(CSc2nc3CCCc3c(=O)[nH]2)cc1
Show InChI InChI=1S/C15H16N2OS/c1-10-5-7-11(8-6-10)9-19-15-16-13-4-2-3-12(13)14(18)17-15/h5-8H,2-4,9H2,1H3,(H,16,17,18)
NCI pathway
Reactome pathway
n/an/a 400n/an/an/an/an/an/a
Translational Research Institute
Curated by ChEMBL
Assay Description
Inhibition of full-length recombinant human MMP-13 assessed as bovine type-2 collagen hydrolysis after 18 hrs by ELISA
J Med Chem 57: 9598-611 (2014)
Article DOI: 10.1021/jm501284e
BindingDB Entry DOI: 10.7270/Q2P55Q3G
3D
3D Structure (crystal)