BDBM50361640 CHEMBL1515648
SMILES: COC(=O)c1ccc(CSc2nc3CCCc3c(=O)[nH]2)cc1
InChI Key: InChIKey=XDOXZFXJIASILF-UHFFFAOYSA-N
Data: 1 KI  12 IC50
Activity Spreadsheet -- Enzyme Inhibition Constant Data from BindingDB
Found 13 hits for monomerid = 50361640
Trg + Lig
Ki
nM
ΔG°
kcal/mole
IC50
nM
Kd
nM
EC50/IC50
nM
koff
s-1
kon
M-1s-1
pHTemp
°C
Collagenase 3
(Homo sapiens (Human))
BDBM50361640
(CHEMBL1515648)
Show SMILES COC(=O)c1ccc(CSc2nc3CCCc3c(=O)[nH]2)cc1
Show InChI InChI=1S/C16H16N2O3S/c1-21-15(20)11-7-5-10(6-8-11)9-22-16-17-13-4-2-3-12(13)14(19)18-16/h5-8H,2-4,9H2,1H3,(H,17,18,19)
NCI pathway
Reactome pathway
1.53E+3n/an/an/an/an/an/an/an/a
Scripps Florida
Curated by ChEMBL
Assay Description
Noncompetitive inhibition of human full length recombinant MMP13 using triple-helical fTHP-15 as substrate by Lineweaver-Burk plot analysis
Bioorg Med Chem Lett 21: 7180-4 (2011)
Article DOI: 10.1016/j.bmcl.2011.09.077
BindingDB Entry DOI: 10.7270/Q27D2VKN
Collagenase 3
(Homo sapiens (Human))
BDBM50361640
(CHEMBL1515648)
Show SMILES COC(=O)c1ccc(CSc2nc3CCCc3c(=O)[nH]2)cc1
Show InChI InChI=1S/C16H16N2O3S/c1-21-15(20)11-7-5-10(6-8-11)9-22-16-17-13-4-2-3-12(13)14(19)18-16/h5-8H,2-4,9H2,1H3,(H,17,18,19)
NCI pathway
Reactome pathway
n/an/a 2.80E+3n/an/an/an/an/an/a
Translational Research Institute
Curated by ChEMBL
Assay Description
Non-competitive inhibition of full-length recombinant human MMP-13 assessed as fTHP-15 substrate hydrolysis
J Med Chem 57: 9598-611 (2014)
Article DOI: 10.1021/jm501284e
BindingDB Entry DOI: 10.7270/Q2P55Q3G
Cytochrome P450 1A
(Homo sapiens (Human))
BDBM50361640
(CHEMBL1515648)
Show SMILES COC(=O)c1ccc(CSc2nc3CCCc3c(=O)[nH]2)cc1
Show InChI InChI=1S/C16H16N2O3S/c1-21-15(20)11-7-5-10(6-8-11)9-22-16-17-13-4-2-3-12(13)14(19)18-16/h5-8H,2-4,9H2,1H3,(H,17,18,19)
Reactome pathway
n/an/a>2.00E+4n/an/an/an/an/an/a
Translational Research Institute
Curated by ChEMBL
Assay Description
Inhibition of CYP1A2 (unknown origin) using tacrin substrate
J Med Chem 57: 9598-611 (2014)
Article DOI: 10.1021/jm501284e
BindingDB Entry DOI: 10.7270/Q2P55Q3G
Cytochrome P450 2B6
(Homo sapiens (Human))
BDBM50361640
(CHEMBL1515648)
Show SMILES COC(=O)c1ccc(CSc2nc3CCCc3c(=O)[nH]2)cc1
Show InChI InChI=1S/C16H16N2O3S/c1-21-15(20)11-7-5-10(6-8-11)9-22-16-17-13-4-2-3-12(13)14(19)18-16/h5-8H,2-4,9H2,1H3,(H,17,18,19)
n/an/a>2.00E+4n/an/an/an/an/an/a
Translational Research Institute
Curated by ChEMBL
Assay Description
Inhibition of CYP2B6 (unknown origin) using bupropion substrate
J Med Chem 57: 9598-611 (2014)
Article DOI: 10.1021/jm501284e
BindingDB Entry DOI: 10.7270/Q2P55Q3G
Cytochrome P450 2C8
(Homo sapiens (Human))
BDBM50361640
(CHEMBL1515648)
Show SMILES COC(=O)c1ccc(CSc2nc3CCCc3c(=O)[nH]2)cc1
Show InChI InChI=1S/C16H16N2O3S/c1-21-15(20)11-7-5-10(6-8-11)9-22-16-17-13-4-2-3-12(13)14(19)18-16/h5-8H,2-4,9H2,1H3,(H,17,18,19)
n/an/a>2.00E+4n/an/an/an/an/an/a
Translational Research Institute
Curated by ChEMBL
Assay Description
Inhibition of CYP2C8 (unknown origin) using amodiaquine substrate
J Med Chem 57: 9598-611 (2014)
Article DOI: 10.1021/jm501284e
BindingDB Entry DOI: 10.7270/Q2P55Q3G
Cytochrome P450 2C9
(Homo sapiens (Human))
BDBM50361640
(CHEMBL1515648)
Show SMILES COC(=O)c1ccc(CSc2nc3CCCc3c(=O)[nH]2)cc1
Show InChI InChI=1S/C16H16N2O3S/c1-21-15(20)11-7-5-10(6-8-11)9-22-16-17-13-4-2-3-12(13)14(19)18-16/h5-8H,2-4,9H2,1H3,(H,17,18,19)
Reactome pathway
n/an/a>2.00E+4n/an/an/an/an/an/a
Translational Research Institute
Curated by ChEMBL
Assay Description
Inhibition of CYP2C9 (unknown origin) using diclofenac substrate
J Med Chem 57: 9598-611 (2014)
Article DOI: 10.1021/jm501284e
BindingDB Entry DOI: 10.7270/Q2P55Q3G
Neutrophil collagenase
(Homo sapiens (Human))
BDBM50361640
(CHEMBL1515648)
Show SMILES COC(=O)c1ccc(CSc2nc3CCCc3c(=O)[nH]2)cc1
Show InChI InChI=1S/C16H16N2O3S/c1-21-15(20)11-7-5-10(6-8-11)9-22-16-17-13-4-2-3-12(13)14(19)18-16/h5-8H,2-4,9H2,1H3,(H,17,18,19)
Reactome pathway
n/an/a>4.00E+4n/an/an/an/an/an/a
Scripps Florida
Curated by ChEMBL
Assay Description
Inhibition of MMP8 expressed in CHO-K1 cells using triple-helical fTHP-15 as substrate after 4 hrs by FRET assay
Bioorg Med Chem Lett 21: 7180-4 (2011)
Article DOI: 10.1016/j.bmcl.2011.09.077
BindingDB Entry DOI: 10.7270/Q27D2VKN
Cytochrome P450 2D6
(Homo sapiens (Human))
BDBM50361640
(CHEMBL1515648)
Show SMILES COC(=O)c1ccc(CSc2nc3CCCc3c(=O)[nH]2)cc1
Show InChI InChI=1S/C16H16N2O3S/c1-21-15(20)11-7-5-10(6-8-11)9-22-16-17-13-4-2-3-12(13)14(19)18-16/h5-8H,2-4,9H2,1H3,(H,17,18,19)
n/an/a>2.00E+4n/an/an/an/an/an/a
Translational Research Institute
Curated by ChEMBL
Assay Description
Inhibition of CYP2D6 (unknown origin) using dextromethophan substrate
J Med Chem 57: 9598-611 (2014)
Article DOI: 10.1021/jm501284e
BindingDB Entry DOI: 10.7270/Q2P55Q3G
Cytochrome P450 3A4
(Homo sapiens (Human))
BDBM50361640
(CHEMBL1515648)
Show SMILES COC(=O)c1ccc(CSc2nc3CCCc3c(=O)[nH]2)cc1
Show InChI InChI=1S/C16H16N2O3S/c1-21-15(20)11-7-5-10(6-8-11)9-22-16-17-13-4-2-3-12(13)14(19)18-16/h5-8H,2-4,9H2,1H3,(H,17,18,19)
Reactome pathway
n/an/a>2.00E+4n/an/an/an/an/an/a
Translational Research Institute
Curated by ChEMBL
Assay Description
Inhibition of CYP3A4 (unknown origin) using midazolam substrate
J Med Chem 57: 9598-611 (2014)
Article DOI: 10.1021/jm501284e
BindingDB Entry DOI: 10.7270/Q2P55Q3G
Cytochrome P450 3A4
(Homo sapiens (Human))
BDBM50361640
(CHEMBL1515648)
Show SMILES COC(=O)c1ccc(CSc2nc3CCCc3c(=O)[nH]2)cc1
Show InChI InChI=1S/C16H16N2O3S/c1-21-15(20)11-7-5-10(6-8-11)9-22-16-17-13-4-2-3-12(13)14(19)18-16/h5-8H,2-4,9H2,1H3,(H,17,18,19)
Reactome pathway
n/an/a>2.00E+4n/an/an/an/an/an/a
Translational Research Institute
Curated by ChEMBL
Assay Description
Inhibition of CYP3A4 (unknown origin) using testosterone substrate
J Med Chem 57: 9598-611 (2014)
Article DOI: 10.1021/jm501284e
BindingDB Entry DOI: 10.7270/Q2P55Q3G
Interstitial collagenase
(Homo sapiens (Human))
BDBM50361640
(CHEMBL1515648)
Show SMILES COC(=O)c1ccc(CSc2nc3CCCc3c(=O)[nH]2)cc1
Show InChI InChI=1S/C16H16N2O3S/c1-21-15(20)11-7-5-10(6-8-11)9-22-16-17-13-4-2-3-12(13)14(19)18-16/h5-8H,2-4,9H2,1H3,(H,17,18,19)
Reactome pathway
n/an/a>4.00E+4n/an/an/an/an/an/a
Scripps Florida
Curated by ChEMBL
Assay Description
Inhibition of MMP1 expressed in Escherichia coli using triple-helical fTHP-15 as substrate after 4 hrs by FRET assay
Bioorg Med Chem Lett 21: 7180-4 (2011)
Article DOI: 10.1016/j.bmcl.2011.09.077
BindingDB Entry DOI: 10.7270/Q27D2VKN
Collagenase 3
(Homo sapiens (Human))
BDBM50361640
(CHEMBL1515648)
Show SMILES COC(=O)c1ccc(CSc2nc3CCCc3c(=O)[nH]2)cc1
Show InChI InChI=1S/C16H16N2O3S/c1-21-15(20)11-7-5-10(6-8-11)9-22-16-17-13-4-2-3-12(13)14(19)18-16/h5-8H,2-4,9H2,1H3,(H,17,18,19)
NCI pathway
Reactome pathway
n/an/a 2.30E+3n/an/an/an/an/an/a
Translational Research Institute
Curated by ChEMBL
Assay Description
Inhibition of full-length recombinant human MMP-13 assessed as bovine type-2 collagen hydrolysis after 18 hrs by ELISA
J Med Chem 57: 9598-611 (2014)
Article DOI: 10.1021/jm501284e
BindingDB Entry DOI: 10.7270/Q2P55Q3G
Cytochrome P450 2C19
(Homo sapiens (Human))
BDBM50361640
(CHEMBL1515648)
Show SMILES COC(=O)c1ccc(CSc2nc3CCCc3c(=O)[nH]2)cc1
Show InChI InChI=1S/C16H16N2O3S/c1-21-15(20)11-7-5-10(6-8-11)9-22-16-17-13-4-2-3-12(13)14(19)18-16/h5-8H,2-4,9H2,1H3,(H,17,18,19)
Reactome pathway
n/an/a>2.00E+4n/an/an/an/an/an/a
Translational Research Institute
Curated by ChEMBL
Assay Description
Inhibition of CYP2C19 (unknown origin) using (S)-mephentoin substrate
J Med Chem 57: 9598-611 (2014)
Article DOI: 10.1021/jm501284e
BindingDB Entry DOI: 10.7270/Q2P55Q3G