BDBM50361692 CHEMBL1940940
SMILES: CCNC(=O)c1noc(c1NC(=O)C1CCN(C)CC1)-c1cc(C(C)C)c(O)cc1O
InChI Key: InChIKey=FEBNBCWBYAPGKX-UHFFFAOYSA-N
Data: 1 IC50
Activity Spreadsheet -- Enzyme Inhibition Constant Data from BindingDB
Found 1 hit for monomerid = 50361692
Trg + Lig
Ki
nM
ΔG°
kcal/mole
IC50
nM
Kd
nM
EC50/IC50
nM
koff
s-1
kon
M-1s-1
pHTemp
°C
Heat shock protein HSP 90-beta
(Homo sapiens (Human))
BDBM50361692
(CHEMBL1940940)
Show SMILES CCNC(=O)c1noc(c1NC(=O)C1CCN(C)CC1)-c1cc(C(C)C)c(O)cc1O
Show InChI InChI=1S/C22H30N4O5/c1-5-23-22(30)19-18(24-21(29)13-6-8-26(4)9-7-13)20(31-25-19)15-10-14(12(2)3)16(27)11-17(15)28/h10-13,27-28H,5-9H2,1-4H3,(H,23,30)(H,24,29)
Reactome pathway
n/an/a 24n/an/an/an/an/an/a
Universit£ degli Studi di Ferrara
Curated by ChEMBL
Assay Description
Binding affinity to Hsp90 after 4 hrs by fluorescence polarization assay
J Med Chem 54: 8592-604 (2011)
Article DOI: 10.1021/jm201155e
BindingDB Entry DOI: 10.7270/Q2QF8T9M