BDBM50361772 CHEMBL1938508
SMILES: C[C@H]([C@H](NC(=O)C(C)(C)N)C(=O)NC(c1ccc(Cl)cc1)C(F)(F)F)c1ccc(cc1)-c1ccccc1
InChI Key: InChIKey=JZLGUOKBQBXEDW-NVQCTNQPSA-N
Data: 1 IC50
Activity Spreadsheet -- Enzyme Inhibition Constant Data from BindingDB
Found 1 hit for monomerid = 50361772
Trg + Lig
Ki
nM
ΔG°
kcal/mole
IC50
nM
Kd
nM
EC50/IC50
nM
koff
s-1
kon
M-1s-1
pHTemp
°C
Prolylcarboxypeptidase (PRCP)
(Homo sapiens (Human))
BDBM50361772
(CHEMBL1938508)
Show SMILES C[C@H]([C@H](NC(=O)C(C)(C)N)C(=O)NC(c1ccc(Cl)cc1)C(F)(F)F)c1ccc(cc1)-c1ccccc1 |r|
Show InChI InChI=1S/C28H29ClF3N3O2/c1-17(18-9-11-20(12-10-18)19-7-5-4-6-8-19)23(34-26(37)27(2,3)33)25(36)35-24(28(30,31)32)21-13-15-22(29)16-14-21/h4-17,23-24H,33H2,1-3H3,(H,34,37)(H,35,36)/t17-,23-,24?/m0/s1
Reactome pathway
n/an/a 1.70n/an/an/an/an/an/a
Merck Research Laboratories
Curated by ChEMBL
Assay Description
Inhibition of recombinant human PrCP using Mca-Ala-Pro-Lys(Dnp)-OH as substrate measured for 30 mins by continuous fluorometric assay
Bioorg Med Chem Lett 22: 658-65 (2011)
Article DOI: 10.1016/j.bmcl.2011.10.060
BindingDB Entry DOI: 10.7270/Q2B56K50